travis_fold:start:worker_info
Worker information
hostname: 39b4a18c-ad81-4eed-ac19-d6936696712d@1.worker-n2-com-696d86f5d9-v6xlg.gce-production-1
version: v6.2.24-6-g098ca78 https://github.com/travis-ci/worker/tree/098ca78612c4c91c488169d6a2c94fbeee1fb89d
instance: travis-job-8d5fa696-9d06-48b5-b42a-bead73e0fa3a travis-ci-ubuntu-2004-1725624879-33e10fe8 (via amqp)
startup: 5.982403307s
travis_fold:end:worker_info
travis_time:start:123274a4
travis_time:end:123274a4:start=1726122713472713401,finish=1726122713674702516,duration=201989115,event=no_world_writable_dirs
travis_time:start:3c590d18
travis_time:end:3c590d18:start=1726122713677254243,finish=1726122713680278442,duration=3024199,event=setup_filter
travis_time:start:00c8550f
travis_time:end:00c8550f:start=1726122713684237437,finish=1726122713692885764,duration=8648327,event=agent
travis_time:start:0280ec40
travis_time:end:0280ec40:start=1726122713695495658,finish=1726122713697450780,duration=1955122,event=check_unsupported
travis_time:start:28914dfd
travis_fold:start:system_info
Build system information
Build language: go
Build dist: focal
Build id: 272286371
Job id: 626063133
Runtime kernel version: 5.15.0-1067-gcp
VM: default
travis-build version: 3a7d1527
Build image provisioning date and time
Fri 06 Sep 2024 12:41:07 PM UTC
Operating System Details
Distributor ID:	Ubuntu
Description:	Ubuntu 20.04.6 LTS
Release:	20.04
Codename:	focal
Systemd Version
systemd 245 (245.4-4ubuntu3.23)
Cookbooks Version
944c230 https://github.com/travis-ci/travis-cookbooks/tree/944c230
git version
git version 2.46.0
bash version
GNU bash, version 5.0.17(1)-release (x86_64-pc-linux-gnu)
gcc version
gcc (Ubuntu 9.4.0-1ubuntu1~20.04.2) 9.4.0
docker version
Client:
 Version:           24.0.7
 API version:       1.43
 Go version:        go1.21.1
 Git commit:        24.0.7-0ubuntu2~20.04.1
 Built:             Wed Mar 13 20:29:24 2024
 OS/Arch:           linux/amd64
 Context:           default

Server:
 Engine:
  Version:          24.0.7
  API version:      1.43 (minimum version 1.12)
  Go version:       go1.21.1
  Git commit:       24.0.7-0ubuntu2~20.04.1
  Built:            Wed Mar 13 20:29:24 2024
  OS/Arch:          linux/amd64
  Experimental:     false
 containerd:
  Version:          1.7.12
  GitCommit:        
 runc:
  Version:          1.1.12-0ubuntu2~20.04.1
  GitCommit:        
 docker-init:
  Version:          0.19.0
  GitCommit:        
clang version
clang version 18.1.8
jq version
jq-1.7.1
bats version
Bats 1.11.0
shellcheck version
0.10.0
shfmt version
v3.8.0
ccache version
3.7.7
cmake version
cmake version 3.29.0
heroku version
heroku/9.2.1 linux-x64 node-v16.20.2
imagemagick version
Version: ImageMagick 6.9.10-23 Q16 x86_64 20190101 https://imagemagick.org
md5deep version
4.4
mercurial version
version 6.5.2
mysql version
mysql  Ver 8.0.39-0ubuntu0.20.04.1 for Linux on x86_64 ((Ubuntu))
openssl version
OpenSSL 1.1.1f  31 Mar 2020
packer version
Packer v1.11.2
postgresql client version
psql (PostgreSQL) 13.16 (Ubuntu 13.16-1.pgdg20.04+1)
ragel version
Ragel State Machine Compiler version 6.10 March 2017
sudo version
1.8.31
gzip version
gzip 1.10
zip version
Zip 3.0
vim version
VIM - Vi IMproved 8.1 (2018 May 18, compiled Sep 04 2024 03:11:27)
iptables version
iptables v1.8.4 (legacy)
curl version
curl 7.68.0 (x86_64-pc-linux-gnu) libcurl/7.68.0 OpenSSL/1.1.1f zlib/1.2.11 brotli/1.0.7 libidn2/2.2.0 libpsl/0.21.0 (+libidn2/2.2.0) libssh/0.9.3/openssl/zlib nghttp2/1.40.0 librtmp/2.3
wget version
GNU Wget 1.20.3 built on linux-gnu.
rsync version
rsync  version 3.1.3  protocol version 31
gimme version
v1.5.4
nvm version
0.40.1
perlbrew version
/home/travis/perl5/perlbrew/bin/perlbrew  - App::perlbrew/0.95
phpenv version
rbenv 1.3.0
rvm version
rvm 1.29.12 (latest) by Michal Papis, Piotr Kuczynski, Wayne E. Seguin [https://rvm.io]
default ruby version
ruby 3.3.5 (2024-09-03 revision ef084cc8f4) [x86_64-linux]
default python version
Python 3.7.17
ElasticSearch version
7.16.3
Installed Firefox version
firefox 99.0
MongoDB version
MongoDB 4.4.29
PhantomJS version
2.1.1
Redis version
redis-server 7.4.0
Pre-installed Go versions
1.23.0
mvn version
Apache Maven 3.9.4 (dfbb324ad4a7c8fb0bf182e6d91b0ae20e3d2dd9)
gradle version
Gradle 8.3!
lein version
Leiningen 2.11.2 on Java 11.0.21 OpenJDK 64-Bit Server VM
Pre-installed Node.js versions
v10.24.1
v12.22.12
v14.21.3
v16.15
v16.20.2
v18.20.3
v18.20.4
v20.17.0
v4.9.1
v6.17.1
v8.17.0
phpenv versions
  system
  7.4
* 7.4.6 (set by /home/travis/.phpenv/version)
  hhvm-stable
  hhvm
composer --version
Composer version 1.10.6 2020-05-06 10:28:10
Pre-installed Ruby versions
ruby-2.7.6
ruby-3.3.5
travis_fold:end:system_info

travis_time:end:28914dfd:start=1726122713700198410,finish=1726122713705455138,duration=5256728,event=show_system_info
travis_time:start:19b915a8
travis_time:end:19b915a8:start=1726122713708026821,finish=1726122713725325872,duration=17299051,event=rm_riak_source
travis_time:start:1122aa50
travis_time:end:1122aa50:start=1726122713728173623,finish=1726122713733220868,duration=5047245,event=fix_rwky_redis
travis_time:start:139e3450
travis_time:end:139e3450:start=1726122713736262889,finish=1726122718291049925,duration=4554787036,event=wait_for_network
travis_time:start:003ef26e
travis_time:end:003ef26e:start=1726122718295412993,finish=1726122718585312430,duration=289899437,event=update_apt_keys
travis_time:start:0f889c10
travis_time:end:0f889c10:start=1726122718589038162,finish=1726122718637891588,duration=48853426,event=fix_hhvm_source
travis_time:start:1c58dbf3
travis_time:end:1c58dbf3:start=1726122718642409811,finish=1726122718652494144,duration=10084333,event=update_mongo_arch
travis_time:start:1f389aa0
travis_time:end:1f389aa0:start=1726122718655988474,finish=1726122718691584513,duration=35596039,event=fix_sudo_enabled_trusty
travis_time:start:01ffd89e
travis_time:end:01ffd89e:start=1726122718695480203,finish=1726122718697624179,duration=2143976,event=update_glibc
travis_time:start:1398686e
travis_time:end:1398686e:start=1726122718701918813,finish=1726122718729950561,duration=28031748,event=clean_up_path
travis_time:start:0ee7d40a
travis_time:end:0ee7d40a:start=1726122718733338296,finish=1726122718742193724,duration=8855428,event=fix_resolv_conf
travis_time:start:0b8ec1e4
travis_time:end:0b8ec1e4:start=1726122718746609497,finish=1726122718756259315,duration=9649818,event=fix_etc_hosts
travis_time:start:2839752a
travis_time:end:2839752a:start=1726122718759641779,finish=1726122718766908112,duration=7266333,event=fix_mvn_settings_xml
travis_time:start:076571dc
travis_time:end:076571dc:start=1726122718771048551,finish=1726122718781062771,duration=10014220,event=no_ipv6_localhost
travis_time:start:231758df
travis_time:end:231758df:start=1726122718784611292,finish=1726122718786988288,duration=2376996,event=fix_etc_mavenrc
travis_time:start:019b1280
OK
travis_time:end:019b1280:start=1726122718791154530,finish=1726122719149359266,duration=358204736,event=fix_perforce_key
travis_time:start:06cf7528
travis_time:end:06cf7528:start=1726122719153601158,finish=1726122719156606830,duration=3005672,event=fix_wwdr_certificate
travis_time:start:0422b1fa
travis_time:end:0422b1fa:start=1726122719160612393,finish=1726122719188695751,duration=28083358,event=put_localhost_first
travis_time:start:0178d320
travis_time:end:0178d320:start=1726122719192573275,finish=1726122719195785232,duration=3211957,event=home_paths
travis_time:start:0239578c
travis_time:end:0239578c:start=1726122719200301971,finish=1726122719213278230,duration=12976259,event=disable_initramfs
travis_time:start:2dbdf176
travis_time:end:2dbdf176:start=1726122719217104876,finish=1726122719350876273,duration=133771397,event=disable_ssh_roaming
travis_time:start:0f3e25e1
travis_time:end:0f3e25e1:start=1726122719354338989,finish=1726122719356428748,duration=2089759,event=debug_tools
travis_time:start:10d691ea
travis_time:end:10d691ea:start=1726122719359863201,finish=1726122719362730946,duration=2867745,event=uninstall_oclint
travis_time:start:1cb3b99e
travis_time:end:1cb3b99e:start=1726122719366058160,finish=1726122719368837071,duration=2778911,event=rvm_use
travis_time:start:04b26b00
travis_time:end:04b26b00:start=1726122719372084780,finish=1726122719380237146,duration=8152366,event=rm_etc_boto_cfg
travis_time:start:2700a1d2
travis_time:end:2700a1d2:start=1726122719383607452,finish=1726122719385705942,duration=2098490,event=rm_oraclejdk8_symlink
travis_time:start:29176b7e
travis_time:end:29176b7e:start=1726122719389104695,finish=1726122719515381457,duration=126276762,event=enable_i386
travis_time:start:0424f366
travis_time:end:0424f366:start=1726122719519637061,finish=1726122719523092578,duration=3455517,event=update_rubygems
travis_time:start:17137e50
travis_time:end:17137e50:start=1726122719527679706,finish=1726122720581111631,duration=1053431925,event=ensure_path_components
travis_time:start:2c8d8dd6
travis_time:end:2c8d8dd6:start=1726122720585874782,finish=1726122720588057421,duration=2182639,event=redefine_curl
travis_time:start:1b150548
travis_time:end:1b150548:start=1726122720592100350,finish=1726122720714783960,duration=122683610,event=nonblock_pipe
travis_time:start:11318fc0
travis_time:end:11318fc0:start=1726122720719604478,finish=1726122726752486518,duration=6032882040,event=apt_get_update
travis_time:start:1308d8c0
travis_time:end:1308d8c0:start=1726122726756371587,finish=1726122726758709434,duration=2337847,event=deprecate_xcode_64
travis_time:start:213e5278
travis_time:end:213e5278:start=1726122726762698200,finish=1726122730740345383,duration=3977647183,event=update_heroku
travis_time:start:06291448
travis_time:end:06291448:start=1726122730744245972,finish=1726122730746898961,duration=2652989,event=shell_session_update
travis_time:start:00750e80
travis_fold:start:docker_mtu_and_registry_mirrors
travis_fold:end:docker_mtu_and_registry_mirrors
travis_time:end:00750e80:start=1726122730751176451,finish=1726122732959206407,duration=2208029956,event=set_docker_mtu_and_registry_mirrors
travis_time:start:0311984e
travis_fold:start:Docker
travis_fold:end:Docker
travis_time:end:0311984e:start=1726122732964484283,finish=1726122732967807137,duration=3322854,event=docker_config
travis_time:start:273a1bb6
travis_fold:start:resolvconf
travis_fold:end:resolvconf
travis_time:end:273a1bb6:start=1726122732972371147,finish=1726122733033951361,duration=61580214,event=resolvconf
travis_time:start:10af6808
travis_time:end:10af6808:start=1726122733038938959,finish=1726122733227642037,duration=188703078,event=maven_central_mirror
travis_time:start:00318d0b
travis_time:end:00318d0b:start=1726122733232381754,finish=1726122733338314952,duration=105933198,event=maven_https
travis_fold:start:apt
travis_time:start:0105c080
$ travis_apt_get_update
travis_time:end:0105c080:start=1726122733343096133,finish=1726122744797354693,duration=11454258560,event=prepare
Installing APT Packages
travis_time:start:0429d888
$ sudo -E apt-get -yq --no-install-suggests --no-install-recommends $(travis_apt_get_options) install rabbitmq-server
Reading package lists...
Building dependency tree...
Reading state information...
rabbitmq-server is already the newest version (3.13.7-1).
The following packages were automatically installed and are no longer required:
  amd64-microcode intel-microcode iucode-tool libglu1-mesa
  libjs-jquery-metadata libjs-jquery-tablesorter libnotify4 libwxbase3.0-0v5
  libwxgtk3.0-gtk3-0v5 linux-image-unsigned-5.4.0-193-generic
  linux-modules-5.4.0-193-generic postgresql-client-12
Use 'sudo apt autoremove' to remove them.
0 upgraded, 0 newly installed, 0 to remove and 10 not upgraded.
travis_time:end:0429d888:start=1726122744802837704,finish=1726122745347103773,duration=544266069,event=prepare
travis_fold:end:apt
travis_time:start:1e50e7d0
travis_fold:start:services
travis_time:start:026f0642
$ sudo systemctl start rabbitmq-server
travis_time:end:026f0642:start=1726122745356086183,finish=1726122745370243301,duration=14157118,event=prepare
travis_time:start:0000a13c
$ sudo systemctl start docker
travis_time:end:0000a13c:start=1726122745374901403,finish=1726122745387700344,duration=12798941,event=prepare
travis_time:start:0841104c
$ sudo systemctl start redis-server
travis_time:end:0841104c:start=1726122745391785194,finish=1726122745473419713,duration=81634519,event=prepare
travis_fold:end:services
travis_time:end:0841104c:start=1726122745391785194,finish=1726122748479988236,duration=3088203042,event=services
travis_time:start:0473b6ce
travis_time:end:0473b6ce:start=1726122748484856811,finish=1726122748487515934,duration=2659123,event=fix_ps4
Updating gimme
travis_time:start:165eb3c1

travis_fold:start:git.checkout
travis_time:start:0853ed72
travis_time:end:0853ed72:start=1726122753637204152,finish=1726122753669765100,duration=32560948,event=checkout
travis_time:start:0d10f078
$ git clone --depth=10 https://github.com/travis-ci/worker.git travis-ci/worker
Cloning into 'travis-ci/worker'...
travis_time:end:0d10f078:start=1726122753674147692,finish=1726122754762431847,duration=1088284155,event=checkout
$ cd travis-ci/worker
travis_time:start:2bd20c37
$ git fetch origin +refs/pull/675/merge: --depth=10
From https://github.com/travis-ci/worker
 * branch            refs/pull/675/merge -> FETCH_HEAD
travis_time:end:2bd20c37:start=1726122754767409161,finish=1726122755123839932,duration=356430771,event=checkout
$ git checkout -qf FETCH_HEAD
travis_fold:end:git.checkout

travis_time:end:2bd20c37:start=1726122754767409161,finish=1726122755222532860,duration=455123699,event=checkout
$ travis_export_go 1.22.x github.com/travis-ci/worker
travis_time:start:33bf90d8

Setting environment variables from repository settings
$ export ARTIFACTS_PATHS=./build
$ export ARTIFACTS_BUCKET=travis-worker-artifacts
$ export ARTIFACTS_PERMISSIONS=public-read
$ export ARTIFACTS_KEY=[secure]
$ export ARTIFACTS_SECRET=[secure]
$ export PACKAGECLOUD_TOKEN=[secure]
$ export DOCKER_HUB_TRIGGER_URL=[secure]
$ export DOCKER_LOGIN_USERNAME=[secure]
$ export DOCKER_LOGIN_PASSWORD=[secure]
$ export VAULT_PASS=[secure]
$ export GCE_PROJECT=[secure]
$ export VAULT_USERNAME=[secure]
$ export VAULT_ADDR=[secure]
$ export CLOUDSDK_CORE_DISABLE_PROMPTS=[secure]

Setting environment variables from .travis.yml
$ export AMQP_URI="amqp://"
$ export GOPATH="$HOME/gopath"
$ export PATH="bin:$HOME/gopath/bin:$HOME/bin:$PATH"
$ export CHECKOUT_ROOT="$HOME/gopath/src/github.com/travis-ci/worker"
$ export GO15VENDOREXPERIMENT='1'
$ export REDIS_URL="redis://"

travis_time:end:33bf90d8:start=1726122755229858646,finish=1726122755247301792,duration=17443146,event=env
travis_time:start:00ae5eee
$ travis_setup_go
$ export GOPATH="/home/travis/gopath"
$ export PATH="/home/travis/gopath/bin:bin:/home/travis/gopath/bin:/home/travis/bin:/home/travis/bin:/home/travis/bin:/home/travis/.local/bin:/usr/local/lib/jvm/openjdk11/bin:/opt/pyenv/shims:/home/travis/.phpenv/shims:/home/travis/perl5/perlbrew/bin:/home/travis/.nvm/versions/node/v18.20.3/bin:/home/travis/.kiex/elixirs/elixir-1.7.4/bin:/home/travis/.kiex/bin:/home/travis/.rvm/gems/ruby-3.3.5/bin:/home/travis/.rvm/gems/ruby-3.3.5@global/bin:/home/travis/.rvm/rubies/ruby-3.3.5/bin:/home/travis/gopath/bin:/home/travis/.gimme/versions/go1.23.0.linux.amd64/bin:/usr/local/maven-3.9.4/bin:/usr/local/cmake-3.29.0/bin:/usr/local/clang-18.1.8/bin:/usr/local/sbin:/usr/local/bin:/usr/sbin:/usr/bin:/sbin:/bin:/snap/bin:/usr/local/ant/bin:/home/travis/.rvm/bin:/home/travis/.phpenv/bin:/opt/pyenv/bin:/home/travis/.yarn/bin"
$ export GO111MODULE="auto"
go: downloading golang.org/dl v0.0.0-20240905150950-a427666708fc
go: golang.org/dl/go1.22.x@latest: module golang.org/dl@latest found (v0.0.0-20240905150950-a427666708fc), but does not contain package golang.org/dl/go1.22.x
go1.22.x: command not found
travis_time:end:00ae5eee:start=1726122755252024614,finish=1726122755764064586,duration=512039972,event=
travis_fold:start:cache.1
Setting up build cache
$ export CASHER_DIR=${TRAVIS_HOME}/.casher
travis_time:start:032f4450
$ Installing caching utilities
travis_time:end:032f4450:start=1726122756499008265,finish=1726122756664034421,duration=165026156,event=setup_casher
travis_time:start:00daf992
travis_time:end:00daf992:start=1726122756670767103,finish=1726122756674205945,duration=3438842,event=setup_casher
travis_time:start:053195e8
attempting to download cache archive
fetching PR.675/cache--linux-focal-8e66efc74188d5464db6c5a9d3decd4835ed340208a6ac39f04af14f2f93a35a--go-1.22.x.tgz
found cache
travis_time:end:053195e8:start=1726122756679861070,finish=1726122759316170683,duration=2636309613,event=setup_casher
travis_time:start:00ad8797
travis_time:end:00ad8797:start=1726122759322100646,finish=1726122759325620181,duration=3519535,event=setup_casher
travis_time:start:06f189d9
adding /home/travis/build/travis-ci/worker/vendor to cache
creating directory /home/travis/build/travis-ci/worker/vendor
adding /home/travis/.cache/go-build to cache
adding /home/travis/gopath/bin to cache
adding /home/travis/gopath/pkg/mod to cache
/home/travis/build/travis-ci/worker/vendor is not yet cached
travis_time:end:06f189d9:start=1726122759331247197,finish=1726122773139472542,duration=13808225345,event=setup_casher
travis_fold:end:cache.1

$ gimme version
v1.5.4
$ go version
go version go1.23.0 linux/amd64
travis_fold:start:go.env
$ go env
GO111MODULE='auto'
GOARCH='amd64'
GOBIN=''
GOCACHE='/home/travis/.cache/go-build'
GOENV='/home/travis/.config/go/env'
GOEXE=''
GOEXPERIMENT=''
GOFLAGS=''
GOHOSTARCH='amd64'
GOHOSTOS='linux'
GOINSECURE=''
GOMODCACHE='/home/travis/gopath/pkg/mod'
GONOPROXY=''
GONOSUMDB=''
GOOS='linux'
GOPATH='/home/travis/gopath'
GOPRIVATE=''
GOPROXY='https://proxy.golang.org,direct'
GOROOT='/home/travis/.gimme/versions/go1.23.0.linux.amd64'
GOSUMDB='sum.golang.org'
GOTMPDIR=''
GOTOOLCHAIN='auto'
GOTOOLDIR='/home/travis/.gimme/versions/go1.23.0.linux.amd64/pkg/tool/linux_amd64'
GOVCS=''
GOVERSION='go1.23.0'
GODEBUG=''
GOTELEMETRY='local'
GOTELEMETRYDIR='/home/travis/.config/go/telemetry'
GCCGO='gccgo'
GOAMD64='v1'
AR='ar'
CC='gcc'
CXX='g++'
CGO_ENABLED='1'
GOMOD='/home/travis/build/travis-ci/worker/go.mod'
GOWORK=''
CGO_CFLAGS='-O2 -g'
CGO_CPPFLAGS=''
CGO_CXXFLAGS='-O2 -g'
CGO_FFLAGS='-O2 -g'
CGO_LDFLAGS='-O2 -g'
PKG_CONFIG='pkg-config'
GOGCCFLAGS='-fPIC -m64 -pthread -Wl,--no-gc-sections -fmessage-length=0 -ffile-prefix-map=/tmp/go-build2231760779=/tmp/go-build -gno-record-gcc-switches'
travis_fold:end:go.env
travis_fold:start:install
travis_time:start:062f3cdf
$ travis_install_go_dependencies 1.22.x -v
Makefile detected
travis_time:end:062f3cdf:start=1726122773517050699,finish=1726122773521470094,duration=4419395,event=install
travis_fold:end:install
travis_time:start:0ed6632c
$ make deps
if ! shfmt -version 2>/dev/null; then \
	curl -o /home/travis/gopath/bin/shfmt -sSL https://github.com/mvdan/sh/releases/download/v2.5.0/shfmt_v2.5.0_linux_amd64; \
	chmod +x /home/travis/gopath/bin/shfmt; \
	shfmt -version; \
fi
v3.8.0
curl -sSfL https://raw.githubusercontent.com/golangci/golangci-lint/master/install.sh | sh -s -- -b /home/travis/bin
golangci/golangci-lint info checking GitHub for latest tag
golangci/golangci-lint info found version: 1.61.0 for v1.61.0/linux/amd64
golangci/golangci-lint info installed /home/travis/bin/golangci-lint
if ! command -v /bin/golangci-lint &>/dev/null; then \
	/home/travis/bin/golangci-lint --version; \
fi
golangci-lint has version 1.61.0 built with go1.23.1 from a1d6c560 on 2024-09-09T17:44:42Z
GO111MODULE=on go mod download
GO111MODULE=on go mod vendor
touch .deps-fetched
travis_time:end:0ed6632c:start=1726122773527320990,finish=1726122776915788602,duration=3388467612,event=script
The command "make deps" exited with 0.
travis_time:start:22d637c0
$ GO111MODULE=on make build
go install -tags netgo -ldflags "-X 'github.com/travis-ci/worker.VersionString=v6.2.24-12-g235e1d3' -X 'github.com/travis-ci/worker.RevisionString=235e1d331cb65aab9b041fe7b88c6f25c695e796' -X 'github.com/travis-ci/worker.RevisionURLString=https://github.com/travis-ci/worker/tree/235e1d331cb65aab9b041fe7b88c6f25c695e796' -X 'github.com/travis-ci/worker.GeneratedString=2024-09-12T06:32:56+0000' -X 'github.com/travis-ci/worker.CopyrightString=© 2018 Travis CI GmbH'" github.com/travis-ci/worker github.com/travis-ci/worker/context github.com/travis-ci/worker/image github.com/travis-ci/worker/ratelimit github.com/travis-ci/worker/config github.com/travis-ci/worker/errors github.com/travis-ci/worker/metrics github.com/travis-ci/worker/ssh github.com/travis-ci/worker/winrm github.com/travis-ci/worker/remote github.com/travis-ci/worker/backend github.com/travis-ci/worker/cmd/...
# github.com/travis-ci/worker/backend
backend/lxd.go:561:40: p.client.GetIntance undefined (type lxd.InstanceServer has no field or method GetIntance)
make: *** [Makefile:76: build] Error 1
travis_time:end:22d637c0:start=1726122776921715059,finish=1726122864840469392,duration=87918754333,event=script
The command "GO111MODULE=on make build" exited with 2.
travis_time:start:1866b120
$ mkdir -p build/linux/amd64
travis_time:end:1866b120:start=1726122864847262754,finish=1726122864852405773,duration=5143019,event=script
The command "mkdir -p build/linux/amd64" exited with 0.
travis_time:start:0b55fdb0
$ cp ${GOPATH%%:*}/bin/travis-worker build/linux/amd64
cp: cannot stat '/home/travis/gopath/bin/travis-worker': No such file or directory
travis_time:end:0b55fdb0:start=1726122864858285831,finish=1726122864864299494,duration=6013663,event=script
The command "cp ${GOPATH%%:*}/bin/travis-worker build/linux/amd64" exited with 1.
travis_time:start:257f34ea
$ make test-no-cover
go test -race -tags netgo -ldflags "-X 'github.com/travis-ci/worker.VersionString=v6.2.24-12-g235e1d3' -X 'github.com/travis-ci/worker.RevisionString=235e1d331cb65aab9b041fe7b88c6f25c695e796' -X 'github.com/travis-ci/worker.RevisionURLString=https://github.com/travis-ci/worker/tree/235e1d331cb65aab9b041fe7b88c6f25c695e796' -X 'github.com/travis-ci/worker.GeneratedString=2024-09-12T06:34:24+0000' -X 'github.com/travis-ci/worker.CopyrightString=© 2018 Travis CI GmbH'" github.com/travis-ci/worker github.com/travis-ci/worker/context github.com/travis-ci/worker/image github.com/travis-ci/worker/ratelimit github.com/travis-ci/worker/config github.com/travis-ci/worker/errors github.com/travis-ci/worker/metrics github.com/travis-ci/worker/ssh github.com/travis-ci/worker/winrm github.com/travis-ci/worker/remote github.com/travis-ci/worker/backend github.com/travis-ci/worker/cmd/...
# github.com/travis-ci/worker/backend
backend/lxd.go:561:40: p.client.GetIntance undefined (type lxd.InstanceServer has no field or method GetIntance)
FAIL	github.com/travis-ci/worker [build failed]
?   	github.com/travis-ci/worker/context	[no test files]
ok  	github.com/travis-ci/worker/image	1.565s
ok  	github.com/travis-ci/worker/ratelimit	1.071s
?   	github.com/travis-ci/worker/errors	[no test files]
?   	github.com/travis-ci/worker/metrics	[no test files]
?   	github.com/travis-ci/worker/ssh	[no test files]
?   	github.com/travis-ci/worker/winrm	[no test files]
?   	github.com/travis-ci/worker/remote	[no test files]
FAIL	github.com/travis-ci/worker/backend [build failed]
FAIL	github.com/travis-ci/worker/cmd/travis-worker [build failed]
ok  	github.com/travis-ci/worker/config	1.026s
FAIL
make: *** [Makefile:65: test-no-cover] Error 1
travis_time:end:257f34ea:start=1726122864870652056,finish=1726122991072483063,duration=126201831007,event=script
The command "make test-no-cover" exited with 2.
travis_time:start:13135690
$ make test-cover
go test -covermode=count -coverprofile=root-coverage.coverprofile \
	-tags netgo -ldflags "-X 'github.com/travis-ci/worker.VersionString=v6.2.24-12-g235e1d3' -X 'github.com/travis-ci/worker.RevisionString=235e1d331cb65aab9b041fe7b88c6f25c695e796' -X 'github.com/travis-ci/worker.RevisionURLString=https://github.com/travis-ci/worker/tree/235e1d331cb65aab9b041fe7b88c6f25c695e796' -X 'github.com/travis-ci/worker.GeneratedString=2024-09-12T06:36:31+0000' -X 'github.com/travis-ci/worker.CopyrightString=© 2018 Travis CI GmbH'" \
	github.com/travis-ci/worker/
# github.com/travis-ci/worker/backend
backend/lxd.go:561:40: p.client.GetIntance undefined (type lxd.InstanceServer has no field or method GetIntance)
FAIL	github.com/travis-ci/worker [build failed]
FAIL
make: *** [Makefile:46: root-coverage.coverprofile] Error 1
travis_time:end:13135690:start=1726122991079745810,finish=1726123012636132718,duration=21556386908,event=script
The command "make test-cover" exited with 2.
travis_time:start:2bb56a90
$ make smoke
./script/smoke
Updated 0 paths from 20eea08
./script/smoke: line 17: ./build/linux/amd64/travis-worker: No such file or directory
make: *** [Makefile:52: smoke] Error 127
travis_time:end:2bb56a90:start=1726123012642408031,finish=1726123012709697499,duration=67289468,event=script
The command "make smoke" exited with 2.
travis_fold:start:before_cache
travis_time:start:13416e88
$ make clean
./script/clean
removed './root-coverage.coverprofile'
travis_time:end:13416e88:start=1726123012715896727,finish=1726123012862726104,duration=146829377,event=before_cache
travis_fold:end:before_cache
travis_fold:start:cache.2
store build cache
travis_time:start:09d68c90
travis_time:end:09d68c90:start=1726123012869134936,finish=1726123012873557982,duration=4423046,event=cache
travis_time:start:105444f4
changes detected (content changed, file is created, or file is deleted):\n/home/travis/build/travis-ci/worker/vendor/cloud.google.com/go/auth/auth.go
/home/travis/build/travis-ci/worker/vendor/cloud.google.com/go/auth/CHANGES.md
/home/travis/build/travis-ci/worker/vendor/cloud.google.com/go/auth/credentials/compute.go
/home/travis/build/travis-ci/worker/vendor/cloud.google.com/go/auth/credentials/detect.go
/home/travis/build/travis-ci/worker/vendor/cloud.google.com/go/auth/credentials/doc.go
/home/travis/build/travis-ci/worker/vendor/cloud.google.com/go/auth/credentials/filetypes.go
/home/travis/build/travis-ci/worker/vendor/cloud.google.com/go/auth/credentials/internal/externalaccount/aws_provider.go
/home/travis/build/travis-ci/worker/vendor/cloud.google.com/go/auth/credentials/internal/externalaccount/executable_provider.go
/home/travis/build/travis-ci/worker/vendor/cloud.google.com/go/auth/credentials/internal/externalaccount/externalaccount.go
/home/travis/build/travis-ci/worker/vendor/cloud.google.com/go/auth/credentials/internal/externalaccount/file_p\n...
changes detected, packing new archive
gzip: warning: GZIP environment variable is deprecated; use an alias or script
uploading PR.675/cache--linux-focal-8e66efc74188d5464db6c5a9d3decd4835ed340208a6ac39f04af14f2f93a35a--go-1.22.x.tgz
cache uploaded
travis_time:end:105444f4:start=1726123012879606651,finish=1726123052483004882,duration=39603398231,event=cache
travis_fold:end:cache.2


Artifacts support disabled for pull requests


Done. Your build exited with 1.