travis_fold:start:worker_info
Worker information
hostname: d9dd3888-695d-4f71-aaf6-8c0240b7ec48@1.worker-n2-com-696d86f5d9-6fb76.gce-production-1
version: v6.2.24-6-g098ca78 https://github.com/travis-ci/worker/tree/098ca78612c4c91c488169d6a2c94fbeee1fb89d
instance: travis-job-54c0bf55-7f0c-415a-9a19-244f73de6033 travis-ci-sardonyx-xenial-1718996396-f7597f3c (via amqp)
startup: 5.972337668s
travis_fold:end:worker_info
travis_time:start:1f2de9f4
travis_time:end:1f2de9f4:start=1724223249732177252,finish=1724223249900199985,duration=168022733,event=no_world_writable_dirs
travis_time:start:0f22384c
travis_time:end:0f22384c:start=1724223249903170279,finish=1724223249906097248,duration=2926969,event=setup_filter
travis_time:start:005d5d68
travis_time:end:005d5d68:start=1724223249911018700,finish=1724223249919362252,duration=8343552,event=agent
travis_time:start:10ab5204
travis_time:end:10ab5204:start=1724223249922324901,finish=1724223249924608469,duration=2283568,event=check_unsupported
travis_time:start:0364c8ea
travis_fold:start:system_info
Build system information
Build language: go
Build dist: xenial
Build id: 271975212
Job id: 625333581
Runtime kernel version: 4.15.0-1098-gcp
travis-build version: 5243a51a
Build image provisioning date and time
Fri Jun 21 19:33:06 UTC 2024
Operating System Details
Distributor ID:	Ubuntu
Description:	Ubuntu 16.04.7 LTS
Release:	16.04
Codename:	xenial
Systemd Version
systemd 229
Cookbooks Version
88b04db https://github.com/travis-ci/travis-cookbooks/tree/88b04db
git version
git version 2.43.0
bash version
GNU bash, version 4.3.48(1)-release (x86_64-pc-linux-gnu)
gcc version
gcc (Ubuntu 5.4.0-6ubuntu1~16.04.12) 5.4.0 20160609
docker version
Client: Docker Engine - Community
 Version:           20.10.7
 API version:       1.41
 Go version:        go1.13.15
 Git commit:        f0df350
 Built:             Wed Jun  2 11:56:47 2021
 OS/Arch:           linux/amd64
 Context:           default
 Experimental:      true

Server: Docker Engine - Community
 Engine:
  Version:          20.10.7
  API version:      1.41 (minimum version 1.12)
  Go version:       go1.13.15
  Git commit:       b0f5bc3
  Built:            Wed Jun  2 11:54:58 2021
  OS/Arch:          linux/amd64
  Experimental:     false
 containerd:
  Version:          1.4.6
  GitCommit:        d71fcd7d8303cbf684402823e425e9dd2e99285d
 runc:
  Version:          1.0.0-rc95
  GitCommit:        b9ee9c6314599f1b4a7f497e1f1f856fe433d3b7
 docker-init:
  Version:          0.19.0
  GitCommit:        de40ad0
clang version
clang version 7.0.0 (tags/RELEASE_700/final)
jq version
jq-1.7.1
bats version
Bats 1.11.0
shellcheck version
0.10.0
shfmt version
v3.8.0
ccache version
3.2.4
cmake version
cmake version 3.26.3
heroku version
heroku/8.11.5 linux-x64 node-v16.20.2
imagemagick version
Version: ImageMagick 6.8.9-9 Q16 x86_64 2020-12-04 http://www.imagemagick.org
md5deep version
4.4
mercurial version
version 5.9.3
mysql version
mysql  Ver 14.14 Distrib 5.7.33, for Linux (x86_64) using  EditLine wrapper
openssl version
OpenSSL 1.0.2g  1 Mar 2016
packer version
1.7.5
postgresql client version
psql (PostgreSQL) 10.17 (Ubuntu 10.17-1.pgdg16.04+1)
ragel version
Ragel State Machine Compiler version 6.8 Feb 2013
sudo version
1.8.16
gzip version
gzip 1.6
zip version
Zip 3.0
vim version
VIM - Vi IMproved 7.4 (2013 Aug 10, compiled Oct 13 2020 16:04:38)
iptables version
iptables v1.6.0
curl version
curl 7.47.0 (x86_64-pc-linux-gnu) libcurl/7.47.0 GnuTLS/3.4.10 zlib/1.2.8 libidn/1.32 librtmp/2.3
wget version
GNU Wget 1.17.1 built on linux-gnu.
rsync version
rsync  version 3.1.1  protocol version 31
gimme version
v1.5.4
nvm version
0.39.7
perlbrew version
/home/travis/perl5/perlbrew/bin/perlbrew  - App::perlbrew/0.95
phpenv version
rbenv 1.2.0
rvm version
rvm 1.29.12 (latest) by Michal Papis, Piotr Kuczynski, Wayne E. Seguin [https://rvm.io]
default ruby version
ruby 3.3.0 (2023-12-25 revision 5124f9ac75) [x86_64-linux]
default python version
Python 3.7.17
CouchDB version
couchdb 1.6.1
ElasticSearch version
7.16.3
Installed Firefox version
firefox 63.0.1
MongoDB version
MongoDB 4.4.29
PhantomJS version
2.1.1
Pre-installed PostgreSQL versions
9.4.26
9.5.25
9.6.22
Redis version
redis-server 7.0.11
Pre-installed Go versions
1.18.4
ant version
Apache Ant(TM) version 1.9.6 compiled on July 20 2018
mvn version
Apache Maven 3.9.4 (dfbb324ad4a7c8fb0bf182e6d91b0ae20e3d2dd9)
gradle version
Gradle 8.3!
lein version
Leiningen 2.11.2 on Java 11.0.21 OpenJDK 64-Bit Server VM
Pre-installed Node.js versions
v10.24.1
v12.22.12
v14.21.3
v16.15
v16.16.0
v16.20.2
v18.20.3
v20.15.0
v4.9.1
v6.17.1
v8.17.0
phpenv versions
  system
  7.4
* 7.4.30 (set by /home/travis/.phpenv/version)
  hhvm-stable
  hhvm
composer --version
Composer version 2.3.7 2022-06-06 16:43:28
Pre-installed Ruby versions
ruby-2.7.6
ruby-3.3.0
travis_fold:end:system_info

travis_time:end:0364c8ea:start=1724223249927694617,finish=1724223249936163432,duration=8468815,event=show_system_info
travis_time:start:089339c0
travis_time:end:089339c0:start=1724223249939320183,finish=1724223249954724119,duration=15403936,event=rm_riak_source
travis_time:start:0045e400
travis_time:end:0045e400:start=1724223249959067069,finish=1724223249964731579,duration=5664510,event=fix_rwky_redis
travis_time:start:1f568682
travis_time:end:1f568682:start=1724223249968255812,finish=1724223252145092547,duration=2176836735,event=wait_for_network
travis_time:start:31994a3b
travis_time:end:31994a3b:start=1724223252150757769,finish=1724223252331190332,duration=180432563,event=update_apt_keys
travis_time:start:0905dd8c
travis_time:end:0905dd8c:start=1724223252336849697,finish=1724223252392271811,duration=55422114,event=fix_hhvm_source
travis_time:start:02f1c6ea
travis_time:end:02f1c6ea:start=1724223252397677689,finish=1724223252400555197,duration=2877508,event=update_mongo_arch
travis_time:start:0239388c
travis_time:end:0239388c:start=1724223252405801583,finish=1724223252448646466,duration=42844883,event=fix_sudo_enabled_trusty
travis_time:start:041498d8
travis_time:end:041498d8:start=1724223252454073189,finish=1724223252456600915,duration=2527726,event=update_glibc
travis_time:start:3401b0fc
travis_time:end:3401b0fc:start=1724223252460349173,finish=1724223252495196930,duration=34847757,event=clean_up_path
travis_time:start:11210bcc
travis_time:end:11210bcc:start=1724223252500482417,finish=1724223252509113503,duration=8631086,event=fix_resolv_conf
travis_time:start:017e9d02
travis_time:end:017e9d02:start=1724223252513029557,finish=1724223252522973631,duration=9944074,event=fix_etc_hosts
travis_time:start:123bc59a
travis_time:end:123bc59a:start=1724223252528797339,finish=1724223252538017083,duration=9219744,event=fix_mvn_settings_xml
travis_time:start:00329ae1
travis_time:end:00329ae1:start=1724223252543331459,finish=1724223252553943265,duration=10611806,event=no_ipv6_localhost
travis_time:start:01310724
travis_time:end:01310724:start=1724223252559370781,finish=1724223252561905766,duration=2534985,event=fix_etc_mavenrc
travis_time:start:3aac7240
OK
travis_time:end:3aac7240:start=1724223252566889352,finish=1724223252841944646,duration=275055294,event=fix_perforce_key
travis_time:start:01f87f11
travis_time:end:01f87f11:start=1724223252847458688,finish=1724223252851124155,duration=3665467,event=fix_wwdr_certificate
travis_time:start:0b2deb78
travis_time:end:0b2deb78:start=1724223252856625869,finish=1724223252883039095,duration=26413226,event=put_localhost_first
travis_time:start:175c9a7c
travis_time:end:175c9a7c:start=1724223252888687173,finish=1724223252892321110,duration=3633937,event=home_paths
travis_time:start:00f189a5
travis_time:end:00f189a5:start=1724223252898093061,finish=1724223252911074809,duration=12981748,event=disable_initramfs
travis_time:start:3c6d8724
travis_time:end:3c6d8724:start=1724223252916124250,finish=1724223253190396950,duration=274272700,event=disable_ssh_roaming
travis_time:start:025cb487
travis_time:end:025cb487:start=1724223253195851353,finish=1724223253198561070,duration=2709717,event=debug_tools
travis_time:start:0e9a6d26
travis_time:end:0e9a6d26:start=1724223253203766818,finish=1724223253207520614,duration=3753796,event=uninstall_oclint
travis_time:start:01e29982
travis_time:end:01e29982:start=1724223253213321568,finish=1724223253216836405,duration=3514837,event=rvm_use
travis_time:start:00993dc8
travis_time:end:00993dc8:start=1724223253222156698,finish=1724223253230965518,duration=8808820,event=rm_etc_boto_cfg
travis_time:start:1733f3a0
travis_time:end:1733f3a0:start=1724223253236002235,finish=1724223253239169625,duration=3167390,event=rm_oraclejdk8_symlink
travis_time:start:0de03fa2
travis_time:end:0de03fa2:start=1724223253244745750,finish=1724223253335896630,duration=91150880,event=enable_i386
travis_time:start:09f8d30c
travis_time:end:09f8d30c:start=1724223253342152207,finish=1724223253347910090,duration=5757883,event=update_rubygems
travis_time:start:1b8adf05
travis_time:end:1b8adf05:start=1724223253353415272,finish=1724223254298413484,duration=944998212,event=ensure_path_components
travis_time:start:23230e7e
travis_time:end:23230e7e:start=1724223254304273484,finish=1724223254307034982,duration=2761498,event=redefine_curl
travis_time:start:018f606a
travis_time:end:018f606a:start=1724223254312373375,finish=1724223254429404431,duration=117031056,event=nonblock_pipe
travis_time:start:0b334239
travis_time:end:0b334239:start=1724223254433665152,finish=1724223269651247152,duration=15217582000,event=apt_get_update
travis_time:start:059d3e4c
travis_time:end:059d3e4c:start=1724223269656430583,finish=1724223269658942575,duration=2511992,event=deprecate_xcode_64
travis_time:start:11478cc0
travis_time:end:11478cc0:start=1724223269664407361,finish=1724223273296562069,duration=3632154708,event=update_heroku
travis_time:start:03773fab
travis_time:end:03773fab:start=1724223273301993388,finish=1724223273304825191,duration=2831803,event=shell_session_update
travis_time:start:220e5ae0
travis_fold:start:docker_mtu_and_registry_mirrors
travis_fold:end:docker_mtu_and_registry_mirrors
travis_time:end:220e5ae0:start=1724223273310937565,finish=1724223277041244650,duration=3730307085,event=set_docker_mtu_and_registry_mirrors
travis_time:start:00990bc4
travis_fold:start:resolvconf
travis_fold:end:resolvconf
travis_time:end:00990bc4:start=1724223277048657324,finish=1724223277118907944,duration=70250620,event=resolvconf
travis_time:start:01d699bb
travis_time:end:01d699bb:start=1724223277129456147,finish=1724223277367157490,duration=237701343,event=maven_central_mirror
travis_time:start:00dd99d3
travis_time:end:00dd99d3:start=1724223277372390223,finish=1724223277493863206,duration=121472983,event=maven_https
travis_fold:start:apt
travis_time:start:0b8511e8
$ travis_apt_get_update
travis_time:end:0b8511e8:start=1724223277499850656,finish=1724223284892429694,duration=7392579038,event=prepare
Installing APT Packages
travis_time:start:3d55e62c
$ sudo -E apt-get -yq --no-install-suggests --no-install-recommends $(travis_apt_get_options) install docker-ce
Reading package lists...
Building dependency tree...
Reading state information...
docker-ce is already the newest version (5:20.10.7~3-0~ubuntu-xenial).
0 upgraded, 0 newly installed, 0 to remove and 13 not upgraded.
travis_time:end:3d55e62c:start=1724223284898559219,finish=1724223285510693853,duration=612134634,event=prepare
travis_fold:end:apt

travis_fold:start:snap
Installing 2 Snaps
travis_time:start:19e548d0
$ sudo snap install core

Ensure prerequisites for "core" are available                                  /
Download snap "core" (17200) from channel "stable"                             -
Download snap "core" (17200) from channel "stable"                             \
Download snap "core" (17200) from channel "stable"                             |
Download snap "core" (17200) from channel "stable"                             /
Download snap "core" (17200) from channel "stable"                             -
Download snap "core" (17200) from channel "stable"                             \
Download snap "core" (17200) from channel "stable"                             |[?25l
Download snap "core" (17200) from channel "stable"             0%     0B/s ages!
Download snap "core" (17200) from channel "stable"             1% 3.38MB/s 32.1s
Download snap "core" (17200) from channel "stable"             4% 12.8MB/s 8.24s
Download snap "core" (17200) from channel "stable"            10% 26.5MB/s 3.71s
Download snap "core" (17200) from channel "stable"            16% 34.3MB/s 2.68s
Download snap "core" (17200) from channel "stable"            22% 40.3MB/s 2.11s
Download snap "core" (17200) from channel "stable"            28% 43.9MB/s 1.78s
Download snap "core" (17200) from channel "stable"            35% 47.1MB/s 1.51s
Download snap "core" (17200) from channel "stable"            41% 49.4MB/s 1.30s
Download snap "core" (17200) from channel "stable"            47% 50.6MB/s 1.15s
Download snap "core" (17200) from channel "stable"            53% 52.0MB/s 990ms
Download snap "core" (17200) from channel "stable"            59% 53.5MB/s 830ms
Download snap "core" (17200) from channel "stable"            65% 54.4MB/s 694ms
Download snap "core" (17200) from channel "stable"            72% 55.5MB/s 552ms
Download snap "core" (17200) from channel "stable"            78% 56.1MB/s 428ms
Download snap "core" (17200) from channel "stable"            84% 57.0MB/s 297ms
Download snap "core" (17200) from channel "stable"            91% 57.6MB/s 175ms
Download snap "core" (17200) from channel "stable"            97% 58.3MB/s  52ms
Download snap "core" (17200) from channel "stable"           100% 56.8MB/s 0.0ns
Download snap "core" (17200) from channel "stable"           100% 54.0MB/s 0.0ns
Download snap "core" (17200) from channel "stable"           100% 51.4MB/s 0.0ns
Fetch and check assertions for snap "core" (17200)                             /
Fetch and check assertions for snap "core" (17200)                             -
Fetch and check assertions for snap "core" (17200)                             \
Fetch and check assertions for snap "core" (17200)                             |
Fetch and check assertions for snap "core" (17200)                             /
Fetch and check assertions for snap "core" (17200)                             -
Fetch and check assertions for snap "core" (17200)                             \
Mount snap "core" (17200)                                                      |
Mount snap "core" (17200)                                                      /
Mount snap "core" (17200)                                                      -
Mount snap "core" (17200)                                                      \
Mount snap "core" (17200)                                                      |
Mount snap "core" (17200)                                                      /
Setup snap "core" (17200) security profiles                                    -
Setup snap "core" (17200) security profiles                                    \
Automatically connect eligible plugs and slots of snap "core"                  |
2024-08-21T06:54:51Z INFO Waiting for automatic snapd restart...

Automatically connect eligible plugs and slots of snap "core"                  /
Run configure hook of "core" snap if present                                   -
[?25hcore 16-2.61.4-20240607 from Canonical* installed
travis_time:end:19e548d0:start=1724223285516454208,finish=1724223293756330924,duration=8239876716,event=prepare
travis_time:start:11c69a72
$ sudo snap install google-cloud-sdk --classic

Ensure prerequisites for "google-cloud-sdk" are available                      /
Ensure prerequisites for "google-cloud-sdk" are available                      -
Ensure prerequisites for "google-cloud-sdk" are available                      \
Download snap "core20" (2318) from channel "stable"                            |
Download snap "core20" (2318) from channel "stable"                            /
Download snap "core20" (2318) from channel "stable"                            -
Download snap "core20" (2318) from channel "stable"                            \
Download snap "core20" (2318) from channel "stable"                            |
Download snap "core20" (2318) from channel "stable"                            /[?25l
Download snap "core20" (2318) from channel "stable"            1% 8.66MB/s 7.64s
Download snap "core20" (2318) from channel "stable"           10% 33.3MB/s 1.81s
Download snap "core20" (2318) from channel "stable"           25% 53.0MB/s 954ms
Download snap "core20" (2318) from channel "stable"           38% 62.0MB/s 666ms
Download snap "core20" (2318) from channel "stable"           51% 66.4MB/s 495ms
Download snap "core20" (2318) from channel "stable"           63% 68.6MB/s 361ms
Download snap "core20" (2318) from channel "stable"           78% 71.8MB/s 210ms
Download snap "core20" (2318) from channel "stable"           92% 73.9MB/s  77ms
Download snap "core20" (2318) from channel "stable"          100% 71.9MB/s 0.0ns
Download snap "core20" (2318) from channel "stable"          100% 64.9MB/s 0.0ns
Fetch and check assertions for snap "core20" (2318)                            -
Fetch and check assertions for snap "core20" (2318)                            \
Fetch and check assertions for snap "core20" (2318)                            |
Fetch and check assertions for snap "core20" (2318)                            /
Mount snap "core20" (2318)                                                     -
Mount snap "core20" (2318)                                                     \
Mount snap "core20" (2318)                                                     |
Mount snap "core20" (2318)                                                     /
Mount snap "core20" (2318)                                                     -
Download snap "google-cloud-sdk" (476) from channel "stable"                   \
Download snap "google-cloud-sdk" (476) from channel "stable"                   |
Download snap "google-cloud-sdk" (476) from channel "stable"                   /
Download snap "google-cloud-sdk" (476) from channel "stable"                   -
Download snap "google-cloud-sdk" (476) from channel "stable"                   \
Download snap "google-cloud-sdk" (476) from channel "stable"                   |[?25l
Download snap "google-cloud-sdk" (476) from channel "stable"   0%     0B/s ages!
Download snap "google-cloud-sdk" (476) from channel "stable"   0% 7.39MB/s 50.2s
Download snap "google-cloud-sdk" (476) from channel "stable"   2% 22.2MB/s 16.5s
Download snap "google-cloud-sdk" (476) from channel "stable"   4% 35.2MB/s 10.2s
Download snap "google-cloud-sdk" (476) from channel "stable"   6% 41.4MB/s 8.50s
Download snap "google-cloud-sdk" (476) from channel "stable"   7% 45.6MB/s 7.57s
Download snap "google-cloud-sdk" (476) from channel "stable"   9% 49.4MB/s 6.83s
Download snap "google-cloud-sdk" (476) from channel "stable"  11% 51.4MB/s 6.43s
Download snap "google-cloud-sdk" (476) from channel "stable"  13% 53.8MB/s 6.01s
Download snap "google-cloud-sdk" (476) from channel "stable"  15% 55.0MB/s 5.75s
Download snap "google-cloud-sdk" (476) from channel "stable"  17% 56.0MB/s 5.53s
Download snap "google-cloud-sdk" (476) from channel "stable"  19% 57.3MB/s 5.28s
Download snap "google-cloud-sdk" (476) from channel "stable"  21% 58.4MB/s 5.04s
Download snap "google-cloud-sdk" (476) from channel "stable"  23% 58.9MB/s 4.89s
Download snap "google-cloud-sdk" (476) from channel "stable"  25% 59.8MB/s 4.69s
Download snap "google-cloud-sdk" (476) from channel "stable"  27% 60.3MB/s 4.54s
Download snap "google-cloud-sdk" (476) from channel "stable"  28% 60.6MB/s 4.40s
Download snap "google-cloud-sdk" (476) from channel "stable"  30% 61.0MB/s 4.27s
Download snap "google-cloud-sdk" (476) from channel "stable"  32% 61.3MB/s 4.14s
Download snap "google-cloud-sdk" (476) from channel "stable"  34% 61.9MB/s 3.97s
Download snap "google-cloud-sdk" (476) from channel "stable"  36% 62.2MB/s 3.83s
Download snap "google-cloud-sdk" (476) from channel "stable"  38% 62.4MB/s 3.71s
Download snap "google-cloud-sdk" (476) from channel "stable"  40% 62.9MB/s 3.56s
Download snap "google-cloud-sdk" (476) from channel "stable"  41% 62.7MB/s 3.48s
Download snap "google-cloud-sdk" (476) from channel "stable"  43% 63.2MB/s 3.33s
Download snap "google-cloud-sdk" (476) from channel "stable"  46% 63.4MB/s 3.21s
Download snap "google-cloud-sdk" (476) from channel "stable"  48% 63.7MB/s 3.07s
Download snap "google-cloud-sdk" (476) from channel "stable"  49% 63.8MB/s 2.96s
Download snap "google-cloud-sdk" (476) from channel "stable"  51% 63.6MB/s 2.88s
Download snap "google-cloud-sdk" (476) from channel "stable"  53% 63.9MB/s 2.74s
Download snap "google-cloud-sdk" (476) from channel "stable"  55% 64.3MB/s 2.60s
Download snap "google-cloud-sdk" (476) from channel "stable"  57% 64.2MB/s 2.51s
Download snap "google-cloud-sdk" (476) from channel "stable"  59% 64.5MB/s 2.38s
Download snap "google-cloud-sdk" (476) from channel "stable"  61% 64.4MB/s 2.28s
Download snap "google-cloud-sdk" (476) from channel "stable"  63% 64.8MB/s 2.14s
Download snap "google-cloud-sdk" (476) from channel "stable"  65% 64.8MB/s 2.03s
Download snap "google-cloud-sdk" (476) from channel "stable"  66% 64.9MB/s 1.93s
Download snap "google-cloud-sdk" (476) from channel "stable"  68% 64.9MB/s 1.82s
Download snap "google-cloud-sdk" (476) from channel "stable"  70% 65.1MB/s 1.70s
Download snap "google-cloud-sdk" (476) from channel "stable"  72% 65.2MB/s 1.58s
Download snap "google-cloud-sdk" (476) from channel "stable"  74% 65.3MB/s 1.48s
Download snap "google-cloud-sdk" (476) from channel "stable"  76% 65.3MB/s 1.37s
Download snap "google-cloud-sdk" (476) from channel "stable"  78% 65.3MB/s 1.27s
Download snap "google-cloud-sdk" (476) from channel "stable"  80% 65.5MB/s 1.15s
Download snap "google-cloud-sdk" (476) from channel "stable"  82% 65.5MB/s 1.05s
Download snap "google-cloud-sdk" (476) from channel "stable"  84% 65.6MB/s 933ms
Download snap "google-cloud-sdk" (476) from channel "stable"  85% 65.6MB/s 830ms
Download snap "google-cloud-sdk" (476) from channel "stable"  87% 65.8MB/s 714ms
Download snap "google-cloud-sdk" (476) from channel "stable"  89% 65.7MB/s 624ms
Download snap "google-cloud-sdk" (476) from channel "stable"  91% 65.9MB/s 508ms
Download snap "google-cloud-sdk" (476) from channel "stable"  93% 65.9MB/s 394ms
Download snap "google-cloud-sdk" (476) from channel "stable"  95% 66.1MB/s 279ms
Download snap "google-cloud-sdk" (476) from channel "stable"  97% 66.1MB/s 177ms
Download snap "google-cloud-sdk" (476) from channel "stable"  99% 66.1MB/s  75ms
Download snap "google-cloud-sdk" (476) from channel "stable" 100% 65.8MB/s 0.0ns
Download snap "google-cloud-sdk" (476) from channel "stable" 100% 64.6MB/s 0.0ns
Download snap "google-cloud-sdk" (476) from channel "stable" 100% 63.5MB/s 0.0ns
Download snap "google-cloud-sdk" (476) from channel "stable" 100% 62.4MB/s 0.0ns
Download snap "google-cloud-sdk" (476) from channel "stable" 100% 61.4MB/s 0.0ns
Download snap "google-cloud-sdk" (476) from channel "stable" 100% 60.4MB/s 0.0ns
Download snap "google-cloud-sdk" (476) from channel "stable" 100% 59.4MB/s 0.0ns
Download snap "google-cloud-sdk" (476) from channel "stable" 100% 58.4MB/s 0.0ns
Download snap "google-cloud-sdk" (476) from channel "stable" 100% 57.5MB/s 0.0ns
Download snap "google-cloud-sdk" (476) from channel "stable" 100% 56.6MB/s 0.0ns
Download snap "google-cloud-sdk" (476) from channel "stable" 100% 55.8MB/s 0.0ns
Download snap "google-cloud-sdk" (476) from channel "stable" 100% 54.9MB/s 0.0ns
Download snap "google-cloud-sdk" (476) from channel "stable" 100% 54.1MB/s 0.0ns
Download snap "google-cloud-sdk" (476) from channel "stable" 100% 53.3MB/s 0.0ns
Fetch and check assertions for snap "google-cloud-sdk" (476)                   /
Fetch and check assertions for snap "google-cloud-sdk" (476)                   -
Fetch and check assertions for snap "google-cloud-sdk" (476)                   \
Fetch and check assertions for snap "google-cloud-sdk" (476)                   |
Fetch and check assertions for snap "google-cloud-sdk" (476)                   /
Fetch and check assertions for snap "google-cloud-sdk" (476)                   -
Fetch and check assertions for snap "google-cloud-sdk" (476)                   \
Mount snap "google-cloud-sdk" (476)                                            |
Mount snap "google-cloud-sdk" (476)                                            /
Mount snap "google-cloud-sdk" (476)                                            -
Mount snap "google-cloud-sdk" (476)                                            \
Mount snap "google-cloud-sdk" (476)                                            |
Mount snap "google-cloud-sdk" (476)                                            /
Mount snap "google-cloud-sdk" (476)                                            -
Mount snap "google-cloud-sdk" (476)                                            \
Mount snap "google-cloud-sdk" (476)                                            |
Mount snap "google-cloud-sdk" (476)                                            /
Mount snap "google-cloud-sdk" (476)                                            -
Mount snap "google-cloud-sdk" (476)                                            \
Mount snap "google-cloud-sdk" (476)                                            |
Mount snap "google-cloud-sdk" (476)                                            /
Mount snap "google-cloud-sdk" (476)                                            -
Mount snap "google-cloud-sdk" (476)                                            \
Mount snap "google-cloud-sdk" (476)                                            |
Mount snap "google-cloud-sdk" (476)                                            /
Mount snap "google-cloud-sdk" (476)                                            -
Mount snap "google-cloud-sdk" (476)                                            \
Mount snap "google-cloud-sdk" (476)                                            |
Mount snap "google-cloud-sdk" (476)                                            /
Set automatic aliases for snap "google-cloud-sdk"                              -
[?25hgoogle-cloud-sdk 489.0.0 from Cloud SDK (google-cloud-sdk**) installed
travis_time:end:11c69a72:start=1724223293762330806,finish=1724223311031838815,duration=17269508009,event=prepare
travis_time:start:09c8d108
$ sudo snap install vault

Ensure prerequisites for "vault" are available                                 /
Ensure prerequisites for "vault" are available                                 -
Download snap "core22" (1439) from channel "stable"                            \
Download snap "core22" (1439) from channel "stable"                            |
Download snap "core22" (1439) from channel "stable"                            /
Download snap "core22" (1439) from channel "stable"                            -
Download snap "core22" (1439) from channel "stable"                            \
Download snap "core22" (1439) from channel "stable"                            |
Download snap "core22" (1439) from channel "stable"                            /
Download snap "core22" (1439) from channel "stable"                            -[?25l
Download snap "core22" (1439) from channel "stable"            0%     0B/s ages!
Download snap "core22" (1439) from channel "stable"            0%     0B/s ages!
Download snap "core22" (1439) from channel "stable"            0%     0B/s ages!
Download snap "core22" (1439) from channel "stable"            0%  401kB/s 3m14s
Download snap "core22" (1439) from channel "stable"            1%  965kB/s 1m20s
Download snap "core22" (1439) from channel "stable"            1% 1.61MB/s 47.8s
Download snap "core22" (1439) from channel "stable"            3% 2.76MB/s 27.5s
Download snap "core22" (1439) from channel "stable"            5% 4.63MB/s 16.0s
Download snap "core22" (1439) from channel "stable"            8% 6.80MB/s 10.5s
Download snap "core22" (1439) from channel "stable"           11% 8.69MB/s 7.94s
Download snap "core22" (1439) from channel "stable"           15% 10.2MB/s 6.48s
Download snap "core22" (1439) from channel "stable"           18% 11.5MB/s 5.53s
Download snap "core22" (1439) from channel "stable"           21% 12.3MB/s 5.03s
Download snap "core22" (1439) from channel "stable"           24% 13.2MB/s 4.47s
Download snap "core22" (1439) from channel "stable"           28% 14.4MB/s 3.89s
Download snap "core22" (1439) from channel "stable"           31% 15.0MB/s 3.57s
Download snap "core22" (1439) from channel "stable"           34% 15.4MB/s 3.32s
Download snap "core22" (1439) from channel "stable"           38% 16.0MB/s 3.04s
Download snap "core22" (1439) from channel "stable"           41% 16.6MB/s 2.76s
Download snap "core22" (1439) from channel "stable"           44% 17.0MB/s 2.54s
Download snap "core22" (1439) from channel "stable"           48% 17.5MB/s 2.33s
Download snap "core22" (1439) from channel "stable"           51% 17.8MB/s 2.13s
Download snap "core22" (1439) from channel "stable"           54% 18.1MB/s 1.96s
Download snap "core22" (1439) from channel "stable"           57% 18.4MB/s 1.80s
Download snap "core22" (1439) from channel "stable"           61% 18.8MB/s 1.61s
Download snap "core22" (1439) from channel "stable"           64% 19.0MB/s 1.46s
Download snap "core22" (1439) from channel "stable"           67% 19.1MB/s 1.34s
Download snap "core22" (1439) from channel "stable"           70% 19.2MB/s 1.20s
Download snap "core22" (1439) from channel "stable"           74% 19.6MB/s 1.03s
Download snap "core22" (1439) from channel "stable"           78% 19.8MB/s 881ms
Download snap "core22" (1439) from channel "stable"           81% 20.0MB/s 752ms
Download snap "core22" (1439) from channel "stable"           84% 20.3MB/s 596ms
Download snap "core22" (1439) from channel "stable"           87% 20.3MB/s 491ms
Download snap "core22" (1439) from channel "stable"           90% 20.4MB/s 368ms
Download snap "core22" (1439) from channel "stable"           94% 20.5MB/s 238ms
Download snap "core22" (1439) from channel "stable"           97% 20.8MB/s  94ms
Download snap "core22" (1439) from channel "stable"          100% 20.7MB/s 0.0ns
Download snap "core22" (1439) from channel "stable"          100% 20.2MB/s 0.0ns
Download snap "core22" (1439) from channel "stable"          100% 19.7MB/s 0.0ns
Fetch and check assertions for snap "core22" (1439)                            \
Fetch and check assertions for snap "core22" (1439)                            |
Fetch and check assertions for snap "core22" (1439)                            /
Fetch and check assertions for snap "core22" (1439)                            -
Fetch and check assertions for snap "core22" (1439)                            \
Fetch and check assertions for snap "core22" (1439)                            |
Mount snap "core22" (1439)                                                     /
Mount snap "core22" (1439)                                                     -
Mount snap "core22" (1439)                                                     \
Mount snap "core22" (1439)                                                     |
Mount snap "core22" (1439)                                                     /
Mount snap "core22" (1439)                                                     -
Download snap "vault" (2314) from channel "1.17/stable"                        \
Download snap "vault" (2314) from channel "1.17/stable"                        |
Download snap "vault" (2314) from channel "1.17/stable"                        /
Download snap "vault" (2314) from channel "1.17/stable"                        -
Download snap "vault" (2314) from channel "1.17/stable"                        \
Download snap "vault" (2314) from channel "1.17/stable"                        |
Download snap "vault" (2314) from channel "1.17/stable"                        /
Download snap "vault" (2314) from channel "1.17/stable"                        -[?25l
Download snap "vault" (2314) from channel "1.17/stable"        0%     0B/s ages!
Download snap "vault" (2314) from channel "1.17/stable"        0%     0B/s ages!
Download snap "vault" (2314) from channel "1.17/stable"        0%     0B/s ages!
Download snap "vault" (2314) from channel "1.17/stable"        0%     0B/s ages!
Download snap "vault" (2314) from channel "1.17/stable"        0%  803kB/s 4m09s
Download snap "vault" (2314) from channel "1.17/stable"        0%  669kB/s 4m59s
Download snap "vault" (2314) from channel "1.17/stable"        1% 1.72MB/s 1m56s
Download snap "vault" (2314) from channel "1.17/stable"        1% 3.52MB/s 56.3s
Download snap "vault" (2314) from channel "1.17/stable"        3% 5.81MB/s 33.6s
Download snap "vault" (2314) from channel "1.17/stable"        4% 7.65MB/s 25.3s
Download snap "vault" (2314) from channel "1.17/stable"        5% 9.15MB/s 20.8s
Download snap "vault" (2314) from channel "1.17/stable"        7% 10.7MB/s 17.5s
Download snap "vault" (2314) from channel "1.17/stable"        8% 11.8MB/s 15.7s
Download snap "vault" (2314) from channel "1.17/stable"        9% 12.7MB/s 14.5s
Download snap "vault" (2314) from channel "1.17/stable"       10% 13.4MB/s 13.4s
Download snap "vault" (2314) from channel "1.17/stable"       12% 14.3MB/s 12.4s
Download snap "vault" (2314) from channel "1.17/stable"       13% 15.1MB/s 11.5s
Download snap "vault" (2314) from channel "1.17/stable"       14% 15.6MB/s 11.0s
Download snap "vault" (2314) from channel "1.17/stable"       16% 16.3MB/s 10.4s
Download snap "vault" (2314) from channel "1.17/stable"       17% 16.7MB/s 10.0s
Download snap "vault" (2314) from channel "1.17/stable"       18% 17.0MB/s 9.65s
Download snap "vault" (2314) from channel "1.17/stable"       19% 17.4MB/s 9.33s
Download snap "vault" (2314) from channel "1.17/stable"       21% 17.8MB/s 8.92s
Download snap "vault" (2314) from channel "1.17/stable"       22% 17.9MB/s 8.77s
Download snap "vault" (2314) from channel "1.17/stable"       23% 18.3MB/s 8.42s
Download snap "vault" (2314) from channel "1.17/stable"       25% 18.7MB/s 8.10s
Download snap "vault" (2314) from channel "1.17/stable"       26% 18.9MB/s 7.88s
Download snap "vault" (2314) from channel "1.17/stable"       27% 19.1MB/s 7.68s
Download snap "vault" (2314) from channel "1.17/stable"       28% 19.4MB/s 7.41s
Download snap "vault" (2314) from channel "1.17/stable"       30% 19.7MB/s 7.15s
Download snap "vault" (2314) from channel "1.17/stable"       31% 19.7MB/s 7.04s
Download snap "vault" (2314) from channel "1.17/stable"       32% 20.0MB/s 6.81s
Download snap "vault" (2314) from channel "1.17/stable"       33% 20.0MB/s 6.70s
Download snap "vault" (2314) from channel "1.17/stable"       35% 20.2MB/s 6.48s
Download snap "vault" (2314) from channel "1.17/stable"       36% 20.4MB/s 6.27s
Download snap "vault" (2314) from channel "1.17/stable"       37% 20.5MB/s 6.12s
Download snap "vault" (2314) from channel "1.17/stable"       39% 20.7MB/s 5.92s
Download snap "vault" (2314) from channel "1.17/stable"       40% 20.8MB/s 5.78s
Download snap "vault" (2314) from channel "1.17/stable"       41% 20.9MB/s 5.64s
Download snap "vault" (2314) from channel "1.17/stable"       43% 21.1MB/s 5.46s
Download snap "vault" (2314) from channel "1.17/stable"       44% 21.2MB/s 5.32s
Download snap "vault" (2314) from channel "1.17/stable"       45% 21.2MB/s 5.19s
Download snap "vault" (2314) from channel "1.17/stable"       47% 21.4MB/s 5.02s
Download snap "vault" (2314) from channel "1.17/stable"       48% 21.5MB/s 4.89s
Download snap "vault" (2314) from channel "1.17/stable"       49% 21.5MB/s 4.76s
Download snap "vault" (2314) from channel "1.17/stable"       50% 21.7MB/s 4.60s
Download snap "vault" (2314) from channel "1.17/stable"       52% 21.8MB/s 4.44s
Download snap "vault" (2314) from channel "1.17/stable"       53% 21.8MB/s 4.35s
Download snap "vault" (2314) from channel "1.17/stable"       54% 21.9MB/s 4.19s
Download snap "vault" (2314) from channel "1.17/stable"       55% 22.0MB/s 4.07s
Download snap "vault" (2314) from channel "1.17/stable"       57% 22.1MB/s 3.92s
Download snap "vault" (2314) from channel "1.17/stable"       58% 22.1MB/s 3.80s
Download snap "vault" (2314) from channel "1.17/stable"       59% 22.2MB/s 3.69s
Download snap "vault" (2314) from channel "1.17/stable"       61% 22.2MB/s 3.57s
Download snap "vault" (2314) from channel "1.17/stable"       62% 22.2MB/s 3.46s
Download snap "vault" (2314) from channel "1.17/stable"       63% 22.3MB/s 3.34s
Download snap "vault" (2314) from channel "1.17/stable"       64% 22.4MB/s 3.20s
Download snap "vault" (2314) from channel "1.17/stable"       66% 22.5MB/s 3.06s
Download snap "vault" (2314) from channel "1.17/stable"       67% 22.4MB/s 2.97s
Download snap "vault" (2314) from channel "1.17/stable"       68% 22.5MB/s 2.83s
Download snap "vault" (2314) from channel "1.17/stable"       70% 22.6MB/s 2.69s
Download snap "vault" (2314) from channel "1.17/stable"       71% 22.6MB/s 2.58s
Download snap "vault" (2314) from channel "1.17/stable"       72% 22.7MB/s 2.47s
Download snap "vault" (2314) from channel "1.17/stable"       73% 22.7MB/s 2.36s
Download snap "vault" (2314) from channel "1.17/stable"       75% 22.8MB/s 2.23s
Download snap "vault" (2314) from channel "1.17/stable"       76% 22.7MB/s 2.16s
Download snap "vault" (2314) from channel "1.17/stable"       76% 22.5MB/s 2.12s
Download snap "vault" (2314) from channel "1.17/stable"       77% 22.4MB/s 2.06s
Download snap "vault" (2314) from channel "1.17/stable"       78% 22.4MB/s 1.97s
Download snap "vault" (2314) from channel "1.17/stable"       79% 22.4MB/s 1.88s
Download snap "vault" (2314) from channel "1.17/stable"       80% 22.4MB/s 1.77s
Download snap "vault" (2314) from channel "1.17/stable"       81% 22.4MB/s 1.66s
Download snap "vault" (2314) from channel "1.17/stable"       83% 22.4MB/s 1.55s
Download snap "vault" (2314) from channel "1.17/stable"       84% 22.5MB/s 1.42s
Download snap "vault" (2314) from channel "1.17/stable"       86% 22.6MB/s 1.29s
Download snap "vault" (2314) from channel "1.17/stable"       87% 22.7MB/s 1.16s
Download snap "vault" (2314) from channel "1.17/stable"       88% 22.6MB/s 1.07s
Download snap "vault" (2314) from channel "1.17/stable"       89% 22.7MB/s 939ms
Download snap "vault" (2314) from channel "1.17/stable"       91% 22.8MB/s 811ms
Download snap "vault" (2314) from channel "1.17/stable"       92% 22.8MB/s 703ms
Download snap "vault" (2314) from channel "1.17/stable"       93% 22.7MB/s 614ms
Download snap "vault" (2314) from channel "1.17/stable"       94% 22.8MB/s 487ms
Download snap "vault" (2314) from channel "1.17/stable"       96% 22.8MB/s 379ms
Download snap "vault" (2314) from channel "1.17/stable"       97% 22.8MB/s 290ms
Download snap "vault" (2314) from channel "1.17/stable"       98% 22.9MB/s 165ms
Download snap "vault" (2314) from channel "1.17/stable"      100% 22.9MB/s  40ms
Download snap "vault" (2314) from channel "1.17/stable"      100% 22.8MB/s 0.0ns
Download snap "vault" (2314) from channel "1.17/stable"      100% 22.5MB/s 0.0ns
Download snap "vault" (2314) from channel "1.17/stable"      100% 22.2MB/s 0.0ns
Download snap "vault" (2314) from channel "1.17/stable"      100% 22.0MB/s 0.0ns
Download snap "vault" (2314) from channel "1.17/stable"      100% 21.8MB/s 0.0ns
Download snap "vault" (2314) from channel "1.17/stable"      100% 21.5MB/s 0.0ns
Download snap "vault" (2314) from channel "1.17/stable"      100% 21.3MB/s 0.0ns
Fetch and check assertions for snap "vault" (2314)                             \
Fetch and check assertions for snap "vault" (2314)                             |
Fetch and check assertions for snap "vault" (2314)                             /
Fetch and check assertions for snap "vault" (2314)                             -
Fetch and check assertions for snap "vault" (2314)                             \
Fetch and check assertions for snap "vault" (2314)                             |
Fetch and check assertions for snap "vault" (2314)                             /
Mount snap "vault" (2314)                                                      -
Mount snap "vault" (2314)                                                      \
Setup snap "vault" (2314) security profiles                                    |
Setup snap "vault" (2314) security profiles for auto-connections               /
Run install hook of "vault" snap if present                                    -
Run install hook of "vault" snap if present                                    \
Run install hook of "vault" snap if present                                    |
Run install hook of "vault" snap if present                                    /
Run install hook of "vault" snap if present                                    -
[?25hvault (1.17/stable) 1.17.2 from Canonical** installed
travis_time:end:09c8d108:start=1724223311038629975,finish=1724223331595212698,duration=20556582723,event=prepare
travis_time:start:12094e9c
$ sudo snap list
Name              Version             Rev    Tracking       Publisher           Notes
core              16-2.61.4-20240607  17200  latest/stable  canonical**         core
core20            20240416            2318   latest/stable  canonical**         base
core22            20240419            1439   latest/stable  canonical**         base
google-cloud-sdk  489.0.0             476    latest/stable  google-cloud-sdk**  classic
vault             1.17.2              2314   1.17/stable    canonical**         -
travis_time:end:12094e9c:start=1724223331601016746,finish=1724223331651762046,duration=50745300,event=prepare
travis_fold:end:snap

travis_time:start:1fe2738d
travis_fold:start:services
travis_time:start:07afca40
$ sudo systemctl start rabbitmq-server
travis_time:end:07afca40:start=1724223331660189426,finish=1724223331672228617,duration=12039191,event=prepare
travis_time:start:0d6015ad
$ sudo systemctl start docker
travis_time:end:0d6015ad:start=1724223331676626598,finish=1724223331688517027,duration=11890429,event=prepare
travis_time:start:2ae5fa52
$ sudo systemctl start redis-server
travis_time:end:2ae5fa52:start=1724223331693742130,finish=1724223331758075007,duration=64332877,event=prepare
travis_fold:end:services
travis_time:end:2ae5fa52:start=1724223331693742130,finish=1724223334763660528,duration=3069918398,event=services
travis_time:start:0088cb60
travis_time:end:0088cb60:start=1724223334768800676,finish=1724223334771692063,duration=2891387,event=fix_ps4
Updating gimme
travis_time:start:0ba23b16

travis_fold:start:git.checkout
travis_time:start:05edc664
travis_time:end:05edc664:start=1724223340848941557,finish=1724223340856126766,duration=7185209,event=checkout
travis_time:start:16a38db8
$ git clone --depth=10 --branch=ga-test210824 https://github.com/travis-ci/worker.git travis-ci/worker
Cloning into 'travis-ci/worker'...
travis_time:end:16a38db8:start=1724223340862023233,finish=1724223341540455677,duration=678432444,event=checkout
$ cd travis-ci/worker
$ git checkout -qf dcdb922533de22d7df309ed841fd405fac80d838
travis_fold:end:git.checkout

travis_time:end:16a38db8:start=1724223340862023233,finish=1724223341555551589,duration=693528356,event=checkout
$ travis_export_go 1.22.x github.com/travis-ci/worker
travis_time:start:2997396f

Setting environment variables from repository settings
$ export ARTIFACTS_PATHS=./build
$ export ARTIFACTS_BUCKET=travis-worker-artifacts
$ export ARTIFACTS_PERMISSIONS=public-read
$ export ARTIFACTS_KEY=[secure]
$ export ARTIFACTS_SECRET=[secure]
$ export PACKAGECLOUD_TOKEN=[secure]
$ export DOCKER_HUB_TRIGGER_URL=[secure]
$ export DOCKER_LOGIN_USERNAME=[secure]
$ export DOCKER_LOGIN_PASSWORD=[secure]
$ export VAULT_PASS=[secure]
$ export GCE_PROJECT=[secure]
$ export VAULT_USERNAME=[secure]
$ export VAULT_ADDR=[secure]
$ export CLOUDSDK_CORE_DISABLE_PROMPTS=[secure]

Setting environment variables from .travis.yml
$ export AMQP_URI="amqp://"
$ export GOPATH="$HOME/gopath"
$ export PATH="bin:$HOME/gopath/bin:$HOME/bin:$PATH"
$ export CHECKOUT_ROOT="$HOME/gopath/src/github.com/travis-ci/worker"
$ export GO15VENDOREXPERIMENT='1'
$ export REDIS_URL="redis://"

travis_time:end:2997396f:start=1724223341564196907,finish=1724223341583612161,duration=19415254,event=env
travis_time:start:0a67ac56
$ travis_setup_go
go version go1.22.6 linux/amd64
$ export GOPATH="/home/travis/gopath"
$ export PATH="/home/travis/gopath/bin:/home/travis/.gimme/versions/go1.22.6.linux.amd64/bin:bin:/home/travis/gopath/bin:/home/travis/bin:/home/travis/bin:/home/travis/bin:/home/travis/.local/bin:/usr/local/lib/jvm/openjdk11/bin:/opt/pyenv/shims:/home/travis/.phpenv/shims:/home/travis/perl5/perlbrew/bin:/home/travis/perl5/perlbrew/perls/5.34.1/bin:/home/travis/.nvm/versions/node/v16.16.0/bin:/home/travis/.rvm/gems/ruby-3.3.0/bin:/home/travis/.rvm/gems/ruby-3.3.0@global/bin:/home/travis/.rvm/rubies/ruby-3.3.0/bin:/home/travis/gopath/bin:/home/travis/.gimme/versions/go1.18.4.linux.amd64/bin:/usr/local/maven-3.9.4/bin:/usr/local/cmake-3.26.3/bin:/usr/local/clang-7.0.0/bin:/usr/local/sbin:/usr/local/bin:/usr/sbin:/usr/bin:/sbin:/bin:/snap/bin:/home/travis/.rvm/bin:/home/travis/.phpenv/bin:/opt/pyenv/bin:/home/travis/.yarn/bin"
$ export GO111MODULE="auto"
travis_time:end:0a67ac56:start=1724223341592325912,finish=1724223344148304580,duration=2555978668,event=
travis_fold:start:cache.1
Setting up build cache
$ export CASHER_DIR=${TRAVIS_HOME}/.casher
travis_time:start:00be71ce
$ Installing caching utilities
travis_time:end:00be71ce:start=1724223344985192194,finish=1724223345249363830,duration=264171636,event=setup_casher
travis_time:start:06337bdb
travis_time:end:06337bdb:start=1724223345256017261,finish=1724223345259079360,duration=3062099,event=setup_casher
travis_time:start:0224c6b0
attempting to download cache archive
fetching ga-test210824/cache--linux-xenial-8e66efc74188d5464db6c5a9d3decd4835ed340208a6ac39f04af14f2f93a35a--go-1.22.x.tgz
fetching ga-test210824/cache-linux-xenial-8e66efc74188d5464db6c5a9d3decd4835ed340208a6ac39f04af14f2f93a35a--go-1.22.x.tgz
fetching ga-test210824/cache--go-1.22.x.tgz
fetching master/cache--linux-xenial-8e66efc74188d5464db6c5a9d3decd4835ed340208a6ac39f04af14f2f93a35a--go-1.22.x.tgz
fetching master/cache-linux-xenial-8e66efc74188d5464db6c5a9d3decd4835ed340208a6ac39f04af14f2f93a35a--go-1.22.x.tgz
fetching master/cache--go-1.22.x.tgz
could not download cache
travis_time:end:0224c6b0:start=1724223345264862100,finish=1724223346966456026,duration=1701593926,event=setup_casher
travis_time:start:12e2bd0b
travis_time:end:12e2bd0b:start=1724223346972386831,finish=1724223346976021309,duration=3634478,event=setup_casher
travis_time:start:0843c275
adding /home/travis/gopath/src/github.com/travis-ci/worker/vendor to cache
creating directory /home/travis/gopath/src/github.com/travis-ci/worker/vendor
adding /home/travis/.cache/go-build to cache
adding /home/travis/gopath/bin to cache
adding /home/travis/gopath/pkg/mod to cache
creating directory /home/travis/gopath/pkg/mod
travis_time:end:0843c275:start=1724223346981563680,finish=1724223348239505702,duration=1257942022,event=setup_casher
travis_fold:end:cache.1

$ gimme version
v1.5.4
$ go version
go version go1.22.6 linux/amd64
travis_fold:start:go.env
$ go env
GO111MODULE='auto'
GOARCH='amd64'
GOBIN=''
GOCACHE='/home/travis/.cache/go-build'
GOENV='/home/travis/.config/go/env'
GOEXE=''
GOEXPERIMENT=''
GOFLAGS=''
GOHOSTARCH='amd64'
GOHOSTOS='linux'
GOINSECURE=''
GOMODCACHE='/home/travis/gopath/pkg/mod'
GONOPROXY=''
GONOSUMDB=''
GOOS='linux'
GOPATH='/home/travis/gopath'
GOPRIVATE=''
GOPROXY='https://proxy.golang.org,direct'
GOROOT='/home/travis/.gimme/versions/go1.22.6.linux.amd64'
GOSUMDB='sum.golang.org'
GOTMPDIR=''
GOTOOLCHAIN='auto'
GOTOOLDIR='/home/travis/.gimme/versions/go1.22.6.linux.amd64/pkg/tool/linux_amd64'
GOVCS=''
GOVERSION='go1.22.6'
GCCGO='gccgo'
GOAMD64='v1'
AR='ar'
CC='gcc'
CXX='g++'
CGO_ENABLED='1'
GOMOD='/home/travis/gopath/src/github.com/travis-ci/worker/go.mod'
GOWORK=''
CGO_CFLAGS='-O2 -g'
CGO_CPPFLAGS=''
CGO_CXXFLAGS='-O2 -g'
CGO_FFLAGS='-O2 -g'
CGO_LDFLAGS='-O2 -g'
PKG_CONFIG='pkg-config'
GOGCCFLAGS='-fPIC -m64 -pthread -Wl,--no-gc-sections -fmessage-length=0 -fdebug-prefix-map=/tmp/go-build2343066176=/tmp/go-build -gno-record-gcc-switches'
travis_fold:end:go.env
travis_fold:start:install
travis_time:start:0059d6c1
$ travis_install_go_dependencies 1.22.x -v
Makefile detected
travis_time:end:0059d6c1:start=1724223348499846684,finish=1724223348504495329,duration=4648645,event=install
travis_fold:end:install
travis_time:start:0ecc4bfc
$ vault login --no-print -method=userpass username=$VAULT_USERNAME password=$VAULT_PASS
time="2024-08-21T06:55:52Z" level=warning msg="DBUS_SESSION_BUS_ADDRESS envvar looks to be not set, this can lead to runaway dbus-daemon processes. To avoid this, set envvar DBUS_SESSION_BUS_ADDRESS=$XDG_RUNTIME_DIR/bus (if it exists) or DBUS_SESSION_BUS_ADDRESS=/dev/null." func="gosnowflake.(*defaultLogger).Warn" file="log.go:244"
travis_time:end:0ecc4bfc:start=1724223348511248872,finish=1724223352629564186,duration=4118315314,event=script
The command "vault login --no-print -method=userpass username=$VAULT_USERNAME password=$VAULT_PASS" exited with 0.
travis_time:start:0544a80e
$ vault kv get -field=secret gcp/[secure]-sa-key > /tmp/[secure]_key.json;
time="2024-08-21T06:55:52Z" level=warning msg="DBUS_SESSION_BUS_ADDRESS envvar looks to be not set, this can lead to runaway dbus-daemon processes. To avoid this, set envvar DBUS_SESSION_BUS_ADDRESS=$XDG_RUNTIME_DIR/bus (if it exists) or DBUS_SESSION_BUS_ADDRESS=/dev/null." func="gosnowflake.(*defaultLogger).Warn" file="log.go:244"
travis_time:end:0544a80e:start=1724223352637929996,finish=1724223353013528137,duration=375598141,event=script
The command "vault kv get -field=secret gcp/[secure]-sa-key > /tmp/[secure]_key.json;" exited with 0.
travis_time:start:13c513e0
$ gcloud -q auth activate-service-account --key-file /tmp/[secure]_key.json;
Activated service account credentials for: [sa-docker-images@[secure].iam.gserviceaccount.com]
travis_time:end:13c513e0:start=1724223353021875430,finish=1724223355089477220,duration=2067601790,event=script
The command "gcloud -q auth activate-service-account --key-file /tmp/[secure]_key.json;" exited with 0.
travis_time:start:05e23d1e
$ gcloud -q config set project ${GCE_PROJECT}
Updated property [core/project].
WARNING: You do not appear to have access to project [[secure]] or it does not exist.
travis_time:end:05e23d1e:start=1724223355097962382,finish=1724223356532298011,duration=1434335629,event=script
The command "gcloud -q config set project ${GCE_PROJECT}" exited with 0.
travis_time:start:0b98bedc
$ gcloud auth configure-docker
Adding credentials for all GCR repositories.
WARNING: A long list of credential helpers may cause delays running 'docker build'. We recommend passing the registry name to configure only the registry you are using.
Docker configuration file updated.
travis_time:end:0b98bedc:start=1724223356538303614,finish=1724223358122048199,duration=1583744585,event=script
The command "gcloud auth configure-docker" exited with 0.
travis_time:start:1561a1fe
$ make docker-build
docker build -t [secure].io/[secure]/worker:v6.2.24-11-gdcdb922 .
Sending build context to Docker daemon  1.127MB


Step 1/16 : FROM golang:1.22 as builder
1.22: Pulling from library/golang
903681d87777: Pulling fs layer
3cbbe86a28c2: Pulling fs layer
6ed93aa58a52: Pulling fs layer
288f02cee7a9: Pulling fs layer
c4c08045297c: Pulling fs layer
70aa3786ec5f: Pulling fs layer
4f4fb700ef54: Pulling fs layer
288f02cee7a9: Waiting
c4c08045297c: Waiting
70aa3786ec5f: Waiting
4f4fb700ef54: Waiting
3cbbe86a28c2: Verifying Checksum
3cbbe86a28c2: Download complete
903681d87777: Verifying Checksum
903681d87777: Download complete
6ed93aa58a52: Verifying Checksum
6ed93aa58a52: Download complete
70aa3786ec5f: Verifying Checksum
70aa3786ec5f: Download complete
4f4fb700ef54: Verifying Checksum
4f4fb700ef54: Download complete
288f02cee7a9: Verifying Checksum
288f02cee7a9: Download complete
c4c08045297c: Verifying Checksum
c4c08045297c: Download complete
903681d87777: Pull complete
3cbbe86a28c2: Pull complete
6ed93aa58a52: Pull complete
288f02cee7a9: Pull complete
c4c08045297c: Pull complete
70aa3786ec5f: Pull complete
4f4fb700ef54: Pull complete
Digest: sha256:367bb5295d3103981a86a572651d8297d6973f2ec8b62f716b007860e22cbc25
Status: Downloaded newer image for golang:1.22
 ---> e39037e2be1b
Step 2/16 : MAINTAINER Travis CI GmbH <support+travis-worker-docker-image@travis-ci.org>
 ---> Running in a5d768898fa1
Removing intermediate container a5d768898fa1
 ---> 9d84969d0fc5
Step 3/16 : COPY . /go/src/github.com/travis-ci/worker
 ---> feead9bc5052
Step 4/16 : WORKDIR /go/src/github.com/travis-ci/worker
 ---> Running in 3ce541520fd1
Removing intermediate container 3ce541520fd1
 ---> 70d847e40e88
Step 5/16 : ENV CGO_ENABLED 0
 ---> Running in 1ec4c6ee8a12
Removing intermediate container 1ec4c6ee8a12
 ---> ec17df123e99
Step 6/16 : RUN make build
 ---> Running in 7aaa6dc155bf
make: bash: Operation not permitted
make: bash: Operation not permitted
make: bash: Operation not permitted
make: bash: Operation not permitted
make: bash: Operation not permitted
make: *** [Makefile:103: .deps-fetched] Error 127
GO111MODULE=on go mod download
The command '/bin/sh -c make build' returned a non-zero code: 2
Makefile:83: recipe for target 'docker-build' failed
make: *** [docker-build] Error 2
travis_time:end:1561a1fe:start=1724223358131347384,finish=1724223384633577125,duration=26502229741,event=script
The command "make docker-build" exited with 2.
travis_time:start:0a396bb7
$ make docker-push
./script/docker-push
time=2024-08-21T06:56:24Z msg="docker login"
WARNING! Your password will be stored unencrypted in /home/travis/.docker/config.json.
Configure a credential helper to remove this warning. See
https://docs.docker.com/engine/reference/commandline/login/#credentials-store

Login Succeeded
time=2024-08-21T06:56:25Z msg="docker push" dest=[secure].io/[secure]/worker:v6.2.24-11-gdcdb922 attempt=1
The push refers to repository [[secure].io/[secure]/worker]
An image does not exist locally with the tag: [secure].io/[secure]/worker
time=2024-08-21T06:56:25Z msg="sleeping" interval=10
time=2024-08-21T06:56:35Z msg="docker push" dest=[secure].io/[secure]/worker:v6.2.24-11-gdcdb922 attempt=2
The push refers to repository [[secure].io/[secure]/worker]
An image does not exist locally with the tag: [secure].io/[secure]/worker
time=2024-08-21T06:56:36Z msg="sleeping" interval=20
time=2024-08-21T06:56:56Z msg="docker push" dest=[secure].io/[secure]/worker:v6.2.24-11-gdcdb922 attempt=3
The push refers to repository [[secure].io/[secure]/worker]
An image does not exist locally with the tag: [secure].io/[secure]/worker
time=2024-08-21T06:56:57Z msg="sleeping" interval=30
time=2024-08-21T06:57:27Z msg="docker push" dest=[secure].io/[secure]/worker:v6.2.24-11-gdcdb922 attempt=4
The push refers to repository [[secure].io/[secure]/worker]
An image does not exist locally with the tag: [secure].io/[secure]/worker
time=2024-08-21T06:57:27Z msg="sleeping" interval=40
time=2024-08-21T06:58:07Z msg="docker push" dest=[secure].io/[secure]/worker:v6.2.24-11-gdcdb922 attempt=5
The push refers to repository [[secure].io/[secure]/worker]
An image does not exist locally with the tag: [secure].io/[secure]/worker
time=2024-08-21T06:58:08Z msg="sleeping" interval=50
time=2024-08-21T06:58:58Z msg="docker push" dest=[secure].io/[secure]/worker:v6.2.24-11-gdcdb922 attempt=6
The push refers to repository [[secure].io/[secure]/worker]
An image does not exist locally with the tag: [secure].io/[secure]/worker
time=2024-08-21T06:58:59Z msg="sleeping" interval=60
time=2024-08-21T06:59:59Z msg="docker push" dest=[secure].io/[secure]/worker:v6.2.24-11-gdcdb922 attempt=7
The push refers to repository [[secure].io/[secure]/worker]
An image does not exist locally with the tag: [secure].io/[secure]/worker
Makefile:52: recipe for target 'docker-push' failed
make: *** [docker-push] Error 86
travis_time:end:0a396bb7:start=1724223384640634304,finish=1724223599943286111,duration=215302651807,event=script
The command "make docker-push" exited with 2.
travis_fold:start:before_cache
travis_time:start:05a1832c
$ make clean
./script/clean
travis_time:end:05a1832c:start=1724223599951446740,finish=1724223600001089374,duration=49642634,event=before_cache
travis_fold:end:before_cache
travis_fold:start:cache.2
store build cache
travis_time:start:326b70eb
travis_time:end:326b70eb:start=1724223600008953402,finish=1724223600012662215,duration=3708813,event=cache
travis_time:start:0bcba3ee
changes detected, packing new archive
uploading ga-test210824/cache--linux-xenial-8e66efc74188d5464db6c5a9d3decd4835ed340208a6ac39f04af14f2f93a35a--go-1.22.x.tgz
cache uploaded
travis_time:end:0bcba3ee:start=1724223600019046224,finish=1724223601316373688,duration=1297327464,event=cache
travis_fold:end:cache.2


Done. Your build exited with 1.