travis_fold:start:worker_info
Worker information
hostname: 170af397-74f7-45ce-98e1-ec99b78bccfb@1.worker-n2-com-696d86f5d9-lxm9v.gce-production-1
version: v6.2.24-6-g098ca78 https://github.com/travis-ci/worker/tree/098ca78612c4c91c488169d6a2c94fbeee1fb89d
instance: travis-job-eec40e3e-d9c4-4fba-ba59-2f0d804cd9e0 travis-ci-sardonyx-xenial-1718996396-f7597f3c (via amqp)
startup: 5.822990984s
travis_fold:end:worker_info
travis_time:start:14da8f39
travis_time:end:14da8f39:start=1724141793643650477,finish=1724141793792581561,duration=148931084,event=no_world_writable_dirs
travis_time:start:1b281264
travis_time:end:1b281264:start=1724141793795290053,finish=1724141793798233833,duration=2943780,event=setup_filter
travis_time:start:13f0daa0
travis_time:end:13f0daa0:start=1724141793803345792,finish=1724141793810859264,duration=7513472,event=agent
travis_time:start:018e580c
travis_time:end:018e580c:start=1724141793813559264,finish=1724141793815696815,duration=2137551,event=check_unsupported
travis_time:start:09b851bc
travis_fold:start:system_info
Build system information
Build language: go
Build dist: xenial
Build id: 271956461
Job id: 625289342
Runtime kernel version: 4.15.0-1098-gcp
travis-build version: 5243a51a
Build image provisioning date and time
Fri Jun 21 19:33:06 UTC 2024
Operating System Details
Distributor ID:	Ubuntu
Description:	Ubuntu 16.04.7 LTS
Release:	16.04
Codename:	xenial
Systemd Version
systemd 229
Cookbooks Version
88b04db https://github.com/travis-ci/travis-cookbooks/tree/88b04db
git version
git version 2.43.0
bash version
GNU bash, version 4.3.48(1)-release (x86_64-pc-linux-gnu)
gcc version
gcc (Ubuntu 5.4.0-6ubuntu1~16.04.12) 5.4.0 20160609
docker version
Client: Docker Engine - Community
 Version:           20.10.7
 API version:       1.41
 Go version:        go1.13.15
 Git commit:        f0df350
 Built:             Wed Jun  2 11:56:47 2021
 OS/Arch:           linux/amd64
 Context:           default
 Experimental:      true

Server: Docker Engine - Community
 Engine:
  Version:          20.10.7
  API version:      1.41 (minimum version 1.12)
  Go version:       go1.13.15
  Git commit:       b0f5bc3
  Built:            Wed Jun  2 11:54:58 2021
  OS/Arch:          linux/amd64
  Experimental:     false
 containerd:
  Version:          1.4.6
  GitCommit:        d71fcd7d8303cbf684402823e425e9dd2e99285d
 runc:
  Version:          1.0.0-rc95
  GitCommit:        b9ee9c6314599f1b4a7f497e1f1f856fe433d3b7
 docker-init:
  Version:          0.19.0
  GitCommit:        de40ad0
clang version
clang version 7.0.0 (tags/RELEASE_700/final)
jq version
jq-1.7.1
bats version
Bats 1.11.0
shellcheck version
0.10.0
shfmt version
v3.8.0
ccache version
3.2.4
cmake version
cmake version 3.26.3
heroku version
heroku/8.11.5 linux-x64 node-v16.20.2
imagemagick version
Version: ImageMagick 6.8.9-9 Q16 x86_64 2020-12-04 http://www.imagemagick.org
md5deep version
4.4
mercurial version
version 5.9.3
mysql version
mysql  Ver 14.14 Distrib 5.7.33, for Linux (x86_64) using  EditLine wrapper
openssl version
OpenSSL 1.0.2g  1 Mar 2016
packer version
1.7.5
postgresql client version
psql (PostgreSQL) 10.17 (Ubuntu 10.17-1.pgdg16.04+1)
ragel version
Ragel State Machine Compiler version 6.8 Feb 2013
sudo version
1.8.16
gzip version
gzip 1.6
zip version
Zip 3.0
vim version
VIM - Vi IMproved 7.4 (2013 Aug 10, compiled Oct 13 2020 16:04:38)
iptables version
iptables v1.6.0
curl version
curl 7.47.0 (x86_64-pc-linux-gnu) libcurl/7.47.0 GnuTLS/3.4.10 zlib/1.2.8 libidn/1.32 librtmp/2.3
wget version
GNU Wget 1.17.1 built on linux-gnu.
rsync version
rsync  version 3.1.1  protocol version 31
gimme version
v1.5.4
nvm version
0.39.7
perlbrew version
/home/travis/perl5/perlbrew/bin/perlbrew  - App::perlbrew/0.95
phpenv version
rbenv 1.2.0
rvm version
rvm 1.29.12 (latest) by Michal Papis, Piotr Kuczynski, Wayne E. Seguin [https://rvm.io]
default ruby version
ruby 3.3.0 (2023-12-25 revision 5124f9ac75) [x86_64-linux]
default python version
Python 3.7.17
CouchDB version
couchdb 1.6.1
ElasticSearch version
7.16.3
Installed Firefox version
firefox 63.0.1
MongoDB version
MongoDB 4.4.29
PhantomJS version
2.1.1
Pre-installed PostgreSQL versions
9.4.26
9.5.25
9.6.22
Redis version
redis-server 7.0.11
Pre-installed Go versions
1.18.4
ant version
Apache Ant(TM) version 1.9.6 compiled on July 20 2018
mvn version
Apache Maven 3.9.4 (dfbb324ad4a7c8fb0bf182e6d91b0ae20e3d2dd9)
gradle version
Gradle 8.3!
lein version
Leiningen 2.11.2 on Java 11.0.21 OpenJDK 64-Bit Server VM
Pre-installed Node.js versions
v10.24.1
v12.22.12
v14.21.3
v16.15
v16.16.0
v16.20.2
v18.20.3
v20.15.0
v4.9.1
v6.17.1
v8.17.0
phpenv versions
  system
  7.4
* 7.4.30 (set by /home/travis/.phpenv/version)
  hhvm-stable
  hhvm
composer --version
Composer version 2.3.7 2022-06-06 16:43:28
Pre-installed Ruby versions
ruby-2.7.6
ruby-3.3.0
travis_fold:end:system_info

travis_time:end:09b851bc:start=1724141793818501466,finish=1724141793825463480,duration=6962014,event=show_system_info
travis_time:start:14205b0a
travis_time:end:14205b0a:start=1724141793828195514,finish=1724141793840921645,duration=12726131,event=rm_riak_source
travis_time:start:2607d92c
travis_time:end:2607d92c:start=1724141793843917687,finish=1724141793849477836,duration=5560149,event=fix_rwky_redis
travis_time:start:1ea70362
travis_time:end:1ea70362:start=1724141793852356226,finish=1724141796714286371,duration=2861930145,event=wait_for_network
travis_time:start:1b6aa00a
travis_time:end:1b6aa00a:start=1724141796719098865,finish=1724141796888688000,duration=169589135,event=update_apt_keys
travis_time:start:0973007a
travis_time:end:0973007a:start=1724141796894308290,finish=1724141796945886365,duration=51578075,event=fix_hhvm_source
travis_time:start:0001d370
travis_time:end:0001d370:start=1724141796950693585,finish=1724141796953530778,duration=2837193,event=update_mongo_arch
travis_time:start:0c4e0370
travis_time:end:0c4e0370:start=1724141796958692918,finish=1724141796999487412,duration=40794494,event=fix_sudo_enabled_trusty
travis_time:start:11638358
travis_time:end:11638358:start=1724141797003598453,finish=1724141797006476986,duration=2878533,event=update_glibc
travis_time:start:0687c1f4
travis_time:end:0687c1f4:start=1724141797010225151,finish=1724141797041314781,duration=31089630,event=clean_up_path
travis_time:start:02ecd3b5
travis_time:end:02ecd3b5:start=1724141797046492323,finish=1724141797054880687,duration=8388364,event=fix_resolv_conf
travis_time:start:1a4a009b
travis_time:end:1a4a009b:start=1724141797059150493,finish=1724141797068123275,duration=8972782,event=fix_etc_hosts
travis_time:start:2be1ea98
travis_time:end:2be1ea98:start=1724141797073165782,finish=1724141797080733595,duration=7567813,event=fix_mvn_settings_xml
travis_time:start:055069a0
travis_time:end:055069a0:start=1724141797085614471,finish=1724141797094746132,duration=9131661,event=no_ipv6_localhost
travis_time:start:05181688
travis_time:end:05181688:start=1724141797100088898,finish=1724141797102584883,duration=2495985,event=fix_etc_mavenrc
travis_time:start:1b00795a
OK
travis_time:end:1b00795a:start=1724141797107870605,finish=1724141797366502348,duration=258631743,event=fix_perforce_key
travis_time:start:0dae9b58
travis_time:end:0dae9b58:start=1724141797370289685,finish=1724141797373242277,duration=2952592,event=fix_wwdr_certificate
travis_time:start:293379f4
travis_time:end:293379f4:start=1724141797378936673,finish=1724141797402662964,duration=23726291,event=put_localhost_first
travis_time:start:163b5160
travis_time:end:163b5160:start=1724141797407377250,finish=1724141797411368490,duration=3991240,event=home_paths
travis_time:start:03ac2120
travis_time:end:03ac2120:start=1724141797416497109,finish=1724141797428036842,duration=11539733,event=disable_initramfs
travis_time:start:06d378a9
travis_time:end:06d378a9:start=1724141797432688912,finish=1724141797703109457,duration=270420545,event=disable_ssh_roaming
travis_time:start:235be115
travis_time:end:235be115:start=1724141797708074453,finish=1724141797710386853,duration=2312400,event=debug_tools
travis_time:start:05c837be
travis_time:end:05c837be:start=1724141797713994593,finish=1724141797716992302,duration=2997709,event=uninstall_oclint
travis_time:start:05f2a80a
travis_time:end:05f2a80a:start=1724141797720434802,finish=1724141797723412286,duration=2977484,event=rvm_use
travis_time:start:0731fa42
travis_time:end:0731fa42:start=1724141797726950922,finish=1724141797734598661,duration=7647739,event=rm_etc_boto_cfg
travis_time:start:0326abd6
travis_time:end:0326abd6:start=1724141797739497011,finish=1724141797742143592,duration=2646581,event=rm_oraclejdk8_symlink
travis_time:start:1b42f0b6
travis_time:end:1b42f0b6:start=1724141797747189150,finish=1724141797831987243,duration=84798093,event=enable_i386
travis_time:start:023b6134
travis_time:end:023b6134:start=1724141797836543425,finish=1724141797841569661,duration=5026236,event=update_rubygems
travis_time:start:02f9ab43
travis_time:end:02f9ab43:start=1724141797846408861,finish=1724141798697806251,duration=851397390,event=ensure_path_components
travis_time:start:1c9132fc
travis_time:end:1c9132fc:start=1724141798703033615,finish=1724141798705581849,duration=2548234,event=redefine_curl
travis_time:start:121e1c2c
travis_time:end:121e1c2c:start=1724141798710437088,finish=1724141798811834563,duration=101397475,event=nonblock_pipe
travis_time:start:272ac570
travis_time:end:272ac570:start=1724141798816413090,finish=1724141804848251457,duration=6031838367,event=apt_get_update
travis_time:start:045e8626
travis_time:end:045e8626:start=1724141804852482978,finish=1724141804855210872,duration=2727894,event=deprecate_xcode_64
travis_time:start:0d5de4f6
travis_time:end:0d5de4f6:start=1724141804859933647,finish=1724141808276694725,duration=3416761078,event=update_heroku
travis_time:start:0c47f912
travis_time:end:0c47f912:start=1724141808280807435,finish=1724141808283562882,duration=2755447,event=shell_session_update
travis_time:start:03788a14
travis_fold:start:docker_mtu_and_registry_mirrors
travis_fold:end:docker_mtu_and_registry_mirrors
travis_time:end:03788a14:start=1724141808288909455,finish=1724141810655635774,duration=2366726319,event=set_docker_mtu_and_registry_mirrors
travis_time:start:08b51cb3
travis_fold:start:resolvconf
travis_fold:end:resolvconf
travis_time:end:08b51cb3:start=1724141810662778056,finish=1724141810725875522,duration=63097466,event=resolvconf
travis_time:start:2dd27560
travis_time:end:2dd27560:start=1724141810734556953,finish=1724141810943156858,duration=208599905,event=maven_central_mirror
travis_time:start:08ceba6e
travis_time:end:08ceba6e:start=1724141810947885743,finish=1724141811057105681,duration=109219938,event=maven_https
travis_fold:start:apt
travis_time:start:10047afb
$ travis_apt_get_update
travis_time:end:10047afb:start=1724141811063369424,finish=1724141819921633244,duration=8858263820,event=prepare
Installing APT Packages
travis_time:start:075a4610
$ sudo -E apt-get -yq --no-install-suggests --no-install-recommends $(travis_apt_get_options) install rabbitmq-server
Reading package lists...
Building dependency tree...
Reading state information...
rabbitmq-server is already the newest version (3.5.7-1ubuntu0.16.04.4).
0 upgraded, 0 newly installed, 0 to remove and 13 not upgraded.
travis_time:end:075a4610:start=1724141819926803875,finish=1724141820452281914,duration=525478039,event=prepare
travis_fold:end:apt
travis_time:start:0c62046a
travis_fold:start:services
travis_time:start:0b2692a2
$ sudo systemctl start rabbitmq-server
travis_time:end:0b2692a2:start=1724141820462013958,finish=1724141820473338293,duration=11324335,event=prepare
travis_time:start:026c68de
$ sudo systemctl start docker
travis_time:end:026c68de:start=1724141820478216237,finish=1724141820489211339,duration=10995102,event=prepare
travis_time:start:1002e8a5
$ sudo systemctl start redis-server
travis_time:end:1002e8a5:start=1724141820493122739,finish=1724141820568182283,duration=75059544,event=prepare
travis_fold:end:services
travis_time:end:1002e8a5:start=1724141820493122739,finish=1724141823574522719,duration=3081399980,event=services
travis_time:start:14162f40
travis_time:end:14162f40:start=1724141823578971206,finish=1724141823581318199,duration=2346993,event=fix_ps4
Updating gimme
travis_time:start:0b2ecf5b

travis_fold:start:git.checkout
travis_time:start:14836b32
travis_time:end:14836b32:start=1724141829601451901,finish=1724141829606468906,duration=5017005,event=checkout
travis_time:start:0780b91f
$ git clone --depth=10 https://github.com/travis-ci/worker.git travis-ci/worker
Cloning into 'travis-ci/worker'...
travis_time:end:0780b91f:start=1724141829611019437,finish=1724141830241129349,duration=630109912,event=checkout
$ cd travis-ci/worker
travis_time:start:18bd0f36
$ git fetch origin +refs/pull/675/merge: --depth=10
From https://github.com/travis-ci/worker
 * branch            refs/pull/675/merge -> FETCH_HEAD
travis_time:end:18bd0f36:start=1724141830246251029,finish=1724141830651043048,duration=404792019,event=checkout
$ git checkout -qf FETCH_HEAD
travis_fold:end:git.checkout

travis_time:end:18bd0f36:start=1724141830246251029,finish=1724141830666290641,duration=420039612,event=checkout
$ travis_export_go 1.18.x github.com/travis-ci/worker
travis_time:start:00095ad8

Setting environment variables from repository settings
$ export ARTIFACTS_PATHS=./build
$ export ARTIFACTS_BUCKET=travis-worker-artifacts
$ export ARTIFACTS_PERMISSIONS=public-read
$ export ARTIFACTS_KEY=[secure]
$ export ARTIFACTS_SECRET=[secure]
$ export PACKAGECLOUD_TOKEN=[secure]
$ export DOCKER_HUB_TRIGGER_URL=[secure]
$ export DOCKER_LOGIN_USERNAME=[secure]
$ export DOCKER_LOGIN_PASSWORD=[secure]
$ export VAULT_PASS=[secure]
$ export GCE_PROJECT=[secure]
$ export VAULT_USERNAME=[secure]
$ export VAULT_ADDR=[secure]
$ export CLOUDSDK_CORE_DISABLE_PROMPTS=[secure]

Setting environment variables from .travis.yml
$ export AMQP_URI="amqp://"
$ export GOPATH="$HOME/gopath"
$ export PATH="bin:$HOME/gopath/bin:$HOME/bin:$PATH"
$ export CHECKOUT_ROOT="$HOME/gopath/src/github.com/travis-ci/worker"
$ export GO15VENDOREXPERIMENT='1'
$ export REDIS_URL="redis://"

travis_time:end:00095ad8:start=1724141830674388198,finish=1724141830697669877,duration=23281679,event=env
travis_time:start:33687000
$ travis_setup_go
go version go1.18.10 linux/amd64
$ export GOPATH="/home/travis/gopath"
$ export PATH="/home/travis/gopath/bin:/home/travis/.gimme/versions/go1.18.10.linux.amd64/bin:bin:/home/travis/gopath/bin:/home/travis/bin:/home/travis/bin:/home/travis/bin:/home/travis/.local/bin:/usr/local/lib/jvm/openjdk11/bin:/opt/pyenv/shims:/home/travis/.phpenv/shims:/home/travis/perl5/perlbrew/bin:/home/travis/perl5/perlbrew/perls/5.34.1/bin:/home/travis/.nvm/versions/node/v16.16.0/bin:/home/travis/.rvm/gems/ruby-3.3.0/bin:/home/travis/.rvm/gems/ruby-3.3.0@global/bin:/home/travis/.rvm/rubies/ruby-3.3.0/bin:/home/travis/gopath/bin:/home/travis/.gimme/versions/go1.18.4.linux.amd64/bin:/usr/local/maven-3.9.4/bin:/usr/local/cmake-3.26.3/bin:/usr/local/clang-7.0.0/bin:/usr/local/sbin:/usr/local/bin:/usr/sbin:/usr/bin:/sbin:/bin:/snap/bin:/home/travis/.rvm/bin:/home/travis/.phpenv/bin:/opt/pyenv/bin:/home/travis/.yarn/bin"
$ export GO111MODULE="auto"
travis_time:end:33687000:start=1724141830702705862,finish=1724141835263569164,duration=4560863302,event=
travis_fold:start:cache.1
Setting up build cache
$ export CASHER_DIR=${TRAVIS_HOME}/.casher
travis_time:start:069ada40
$ Installing caching utilities
travis_time:end:069ada40:start=1724141836009536448,finish=1724141836275245492,duration=265709044,event=setup_casher
travis_time:start:1493da3c
travis_time:end:1493da3c:start=1724141836281159950,finish=1724141836283900461,duration=2740511,event=setup_casher
travis_time:start:37fda500
attempting to download cache archive
fetching PR.675/cache--linux-xenial-8e66efc74188d5464db6c5a9d3decd4835ed340208a6ac39f04af14f2f93a35a--go-1.18.x.tgz
fetching PR.675/cache-linux-xenial-8e66efc74188d5464db6c5a9d3decd4835ed340208a6ac39f04af14f2f93a35a--go-1.18.x.tgz
fetching PR.675/cache--go-1.18.x.tgz
fetching master/cache--linux-xenial-8e66efc74188d5464db6c5a9d3decd4835ed340208a6ac39f04af14f2f93a35a--go-1.18.x.tgz
found cache
travis_time:end:37fda500:start=1724141836288905341,finish=1724141841246997135,duration=4958091794,event=setup_casher
travis_time:start:070e610e
travis_time:end:070e610e:start=1724141841252451405,finish=1724141841255398750,duration=2947345,event=setup_casher
travis_time:start:00e635df
adding /home/travis/gopath/src/github.com/travis-ci/worker/vendor to cache
creating directory /home/travis/gopath/src/github.com/travis-ci/worker/vendor
adding /home/travis/.cache/go-build to cache
adding /home/travis/gopath/bin to cache
adding /home/travis/gopath/pkg/mod to cache
creating directory /home/travis/gopath/pkg/mod
travis_time:end:00e635df:start=1724141841261113192,finish=1724141872131520720,duration=30870407528,event=setup_casher
travis_fold:end:cache.1

$ gimme version
v1.5.4
$ go version
go version go1.18.10 linux/amd64
travis_fold:start:go.env
$ go env
GO111MODULE="auto"
GOARCH="amd64"
GOBIN=""
GOCACHE="/home/travis/.cache/go-build"
GOENV="/home/travis/.config/go/env"
GOEXE=""
GOEXPERIMENT=""
GOFLAGS=""
GOHOSTARCH="amd64"
GOHOSTOS="linux"
GOINSECURE=""
GOMODCACHE="/home/travis/gopath/pkg/mod"
GONOPROXY=""
GONOSUMDB=""
GOOS="linux"
GOPATH="/home/travis/gopath"
GOPRIVATE=""
GOPROXY="https://proxy.golang.org,direct"
GOROOT="/home/travis/.gimme/versions/go1.18.10.linux.amd64"
GOSUMDB="sum.golang.org"
GOTMPDIR=""
GOTOOLDIR="/home/travis/.gimme/versions/go1.18.10.linux.amd64/pkg/tool/linux_amd64"
GOVCS=""
GOVERSION="go1.18.10"
GCCGO="gccgo"
GOAMD64="v1"
AR="ar"
CC="gcc"
CXX="g++"
CGO_ENABLED="1"
GOMOD="/home/travis/gopath/src/github.com/travis-ci/worker/go.mod"
GOWORK=""
CGO_CFLAGS="-g -O2"
CGO_CPPFLAGS=""
CGO_CXXFLAGS="-g -O2"
CGO_FFLAGS="-g -O2"
CGO_LDFLAGS="-g -O2"
PKG_CONFIG="pkg-config"
GOGCCFLAGS="-fPIC -m64 -pthread -fmessage-length=0 -fdebug-prefix-map=/tmp/go-build2736322321=/tmp/go-build -gno-record-gcc-switches"
travis_fold:end:go.env
travis_fold:start:install
travis_time:start:0826c359
$ travis_install_go_dependencies 1.18.x -v
Makefile detected
travis_time:end:0826c359:start=1724141872285114910,finish=1724141872288513162,duration=3398252,event=install
travis_fold:end:install
travis_time:start:26418787
$ make deps
if ! shfmt -version 2>/dev/null; then \
	curl -o /home/travis/gopath/bin/shfmt -sSL https://github.com/mvdan/sh/releases/download/v2.5.0/shfmt_v2.5.0_linux_amd64; \
	chmod +x /home/travis/gopath/bin/shfmt; \
	shfmt -version; \
fi
v3.8.0
curl -sSfL https://raw.githubusercontent.com/golangci/golangci-lint/master/install.sh | sh -s -- -b /home/travis/bin
golangci/golangci-lint info checking GitHub for latest tag
golangci/golangci-lint info found version: 1.60.1 for v1.60.1/linux/amd64
golangci/golangci-lint info installed /home/travis/bin/golangci-lint
if ! command -v /bin/golangci-lint &>/dev/null; then \
	/home/travis/bin/golangci-lint --version; \
fi
golangci-lint has version 1.60.1 built with go1.23.0 from 3298c104 on 2024-08-14T01:15:05Z
GO111MODULE=on go mod download
go: errors parsing go.mod:
/home/travis/gopath/src/github.com/travis-ci/worker/go.mod:3: invalid go version '1.22.5': must match format 1.23
Makefile:103: recipe for target '.deps-fetched' failed
make: *** [.deps-fetched] Error 1
travis_time:end:26418787:start=1724141872294697114,finish=1724141874839526202,duration=2544829088,event=script
The command "make deps" exited with 2.
travis_time:start:2268ab0c
$ GO111MODULE=on make build
GO111MODULE=on go mod download
go: errors parsing go.mod:
/home/travis/gopath/src/github.com/travis-ci/worker/go.mod:3: invalid go version '1.22.5': must match format 1.23
Makefile:103: recipe for target '.deps-fetched' failed
make: *** [.deps-fetched] Error 1
travis_time:end:2268ab0c:start=1724141874845880034,finish=1724141874894281888,duration=48401854,event=script
The command "GO111MODULE=on make build" exited with 2.
travis_time:start:0254cd88
$ mkdir -p build/linux/amd64
travis_time:end:0254cd88:start=1724141874901864738,finish=1724141874906158915,duration=4294177,event=script
The command "mkdir -p build/linux/amd64" exited with 0.
travis_time:start:061a8a00
$ cp ${GOPATH%%:*}/bin/travis-worker build/linux/amd64
cp: cannot stat '/home/travis/gopath/bin/travis-worker': No such file or directory
travis_time:end:061a8a00:start=1724141874912871250,finish=1724141874918081149,duration=5209899,event=script
The command "cp ${GOPATH%%:*}/bin/travis-worker build/linux/amd64" exited with 1.
travis_time:start:02e94430
$ make test-no-cover
go test -race -tags netgo -ldflags "-X 'github.com/travis-ci/worker.VersionString=v6.2.24-8-g98f8992' -X 'github.com/travis-ci/worker.RevisionString=98f89924bc4aaa8f040b815c51cb3611525a1de2' -X 'github.com/travis-ci/worker.RevisionURLString=https://github.com/travis-ci/worker/tree/98f89924bc4aaa8f040b815c51cb3611525a1de2' -X 'github.com/travis-ci/worker.GeneratedString=2024-08-20T08:17:54+0000' -X 'github.com/travis-ci/worker.CopyrightString=© 2018 Travis CI GmbH'" github.com/travis-ci/worker github.com/travis-ci/worker/remote github.com/travis-ci/worker/image github.com/travis-ci/worker/ssh github.com/travis-ci/worker/metrics github.com/travis-ci/worker/config github.com/travis-ci/worker/context github.com/travis-ci/worker/winrm github.com/travis-ci/worker/errors github.com/travis-ci/worker/ratelimit github.com/travis-ci/worker/backend github.com/travis-ci/worker/cmd/...
go: errors parsing go.mod:
/home/travis/gopath/src/github.com/travis-ci/worker/go.mod:3: invalid go version '1.22.5': must match format 1.23
Makefile:65: recipe for target 'test-no-cover' failed
make: *** [test-no-cover] Error 1
travis_time:end:02e94430:start=1724141874924556439,finish=1724141875001874402,duration=77317963,event=script
The command "make test-no-cover" exited with 2.
travis_time:start:03379146
$ make test-cover
go test -covermode=count -coverprofile=root-coverage.coverprofile \
	-tags netgo -ldflags "-X 'github.com/travis-ci/worker.VersionString=v6.2.24-8-g98f8992' -X 'github.com/travis-ci/worker.RevisionString=98f89924bc4aaa8f040b815c51cb3611525a1de2' -X 'github.com/travis-ci/worker.RevisionURLString=https://github.com/travis-ci/worker/tree/98f89924bc4aaa8f040b815c51cb3611525a1de2' -X 'github.com/travis-ci/worker.GeneratedString=2024-08-20T08:17:55+0000' -X 'github.com/travis-ci/worker.CopyrightString=© 2018 Travis CI GmbH'" \
	github.com/travis-ci/worker/
go: errors parsing go.mod:
/home/travis/gopath/src/github.com/travis-ci/worker/go.mod:3: invalid go version '1.22.5': must match format 1.23
Makefile:46: recipe for target 'root-coverage.coverprofile' failed
make: *** [root-coverage.coverprofile] Error 1
travis_time:end:03379146:start=1724141875007840949,finish=1724141875079628398,duration=71787449,event=script
The command "make test-cover" exited with 2.
travis_time:start:25f69bde
$ make smoke
./script/smoke
Updated 0 paths from ae75850
./script/smoke: line 17: ./build/linux/amd64/travis-worker: No such file or directory
Makefile:52: recipe for target 'smoke' failed
make: *** [smoke] Error 1
travis_time:end:25f69bde:start=1724141875085884919,finish=1724141875141424187,duration=55539268,event=script
The command "make smoke" exited with 2.
travis_fold:start:before_cache
travis_time:start:01f10d32
$ make clean
./script/clean
travis_time:end:01f10d32:start=1724141875148263900,finish=1724141875380015520,duration=231751620,event=before_cache
travis_fold:end:before_cache
travis_fold:start:cache.2
store build cache
travis_time:start:0baf0430
travis_time:end:0baf0430:start=1724141875386456645,finish=1724141875390093706,duration=3637061,event=cache
travis_time:start:22307f38
nothing changed
travis_time:end:22307f38:start=1724141875394628023,finish=1724141882851142218,duration=7456514195,event=cache
travis_fold:end:cache.2


Artifacts support disabled for pull requests


Done. Your build exited with 1.