travis_fold:start:worker_info
Worker information
hostname: 85a726cc-9da0-4512-9039-6fac5b353fd3@1.worker-com-oss-6ff4ffc9b7-tl2fj.gce-production-3
version: v6.2.24 https://github.com/travis-ci/worker/tree/ee57d650a7692c1ac03f74ac073d0fd150c9f030
instance: travis-job-54da276d-c850-42c5-bc31-7f264fdfbd17 travis-ci-ubuntu-2004-1718191197-38d8975c (via amqp)
startup: 6.049822209s
travis_fold:end:worker_info
travis_time:start:0d2e8928
travis_time:end:0d2e8928:start=1720562091961954035,finish=1720562092267406787,duration=305452752,event=no_world_writable_dirs
travis_time:start:18fd3b58
travis_time:end:18fd3b58:start=1720562092270303505,finish=1720562092277628772,duration=7325267,event=agent
travis_time:start:070cdeaa
travis_time:end:070cdeaa:start=1720562092280164789,finish=1720562092282072904,duration=1908115,event=check_unsupported
travis_time:start:0333cf6e
travis_fold:start:system_info
Build system information
Build language: java
Build dist: focal
Build id: 271349067
Job id: 623872965
Runtime kernel version: 5.15.0-1062-gcp
travis-build version: 3484ecfe
Build image provisioning date and time
Wed 12 Jun 2024 11:42:45 AM UTC
Operating System Details
Distributor ID:	Ubuntu
Description:	Ubuntu 20.04.6 LTS
Release:	20.04
Codename:	focal
Systemd Version
systemd 245 (245.4-4ubuntu3.23)
Cookbooks Version
41af193 https://github.com/travis-ci/travis-cookbooks/tree/41af193
git version
git version 2.45.2
bash version
GNU bash, version 5.0.17(1)-release (x86_64-pc-linux-gnu)
gcc version
gcc (Ubuntu 9.4.0-1ubuntu1~20.04.2) 9.4.0
docker version
Client:
 Version:           24.0.7
 API version:       1.43
 Go version:        go1.21.1
 Git commit:        24.0.7-0ubuntu2~20.04.1
 Built:             Wed Mar 13 20:29:24 2024
 OS/Arch:           linux/amd64
 Context:           default

Server:
 Engine:
  Version:          24.0.7
  API version:      1.43 (minimum version 1.12)
  Go version:       go1.21.1
  Git commit:       24.0.7-0ubuntu2~20.04.1
  Built:            Wed Mar 13 20:29:24 2024
  OS/Arch:          linux/amd64
  Experimental:     false
 containerd:
  Version:          1.7.12
  GitCommit:        
 runc:
  Version:          1.1.12-0ubuntu2~20.04.1
  GitCommit:        
 docker-init:
  Version:          0.19.0
  GitCommit:        
clang version
clang version 16.0.0
jq version
jq-1.7.1
bats version
Bats 1.11.0
shellcheck version
0.10.0
shfmt version
v3.8.0
ccache version
3.7.7
cmake version
cmake version 3.29.0
heroku version
heroku/8.11.5 linux-x64 node-v16.20.2
imagemagick version
Version: ImageMagick 6.9.10-23 Q16 x86_64 20190101 https://imagemagick.org
md5deep version
4.4
mercurial version
version 6.5.2
mysql version
mysql  Ver 8.0.37-0ubuntu0.20.04.3 for Linux on x86_64 ((Ubuntu))
openssl version
OpenSSL 1.1.1f  31 Mar 2020
packer version
Packer v1.11.0
postgresql client version
psql (PostgreSQL) 13.15 (Ubuntu 13.15-1.pgdg20.04+1)
ragel version
Ragel State Machine Compiler version 6.10 March 2017
sudo version
1.8.31
gzip version
gzip 1.10
zip version
Zip 3.0
vim version
VIM - Vi IMproved 8.1 (2018 May 18, compiled May 03 2024 02:36:35)
iptables version
iptables v1.8.4 (legacy)
curl version
curl 7.68.0 (x86_64-pc-linux-gnu) libcurl/7.68.0 OpenSSL/1.1.1f zlib/1.2.11 brotli/1.0.7 libidn2/2.2.0 libpsl/0.21.0 (+libidn2/2.2.0) libssh/0.9.3/openssl/zlib nghttp2/1.40.0 librtmp/2.3
wget version
GNU Wget 1.20.3 built on linux-gnu.
rsync version
rsync  version 3.1.3  protocol version 31
gimme version
v1.5.4
nvm version
0.39.7
perlbrew version
/home/travis/perl5/perlbrew/bin/perlbrew  - App::perlbrew/0.95
phpenv version
rbenv 1.2.0
rvm version
rvm 1.29.12 (latest) by Michal Papis, Piotr Kuczynski, Wayne E. Seguin [https://rvm.io]
default ruby version
ruby 3.3.0 (2023-12-25 revision 5124f9ac75) [x86_64-linux]
default python version
Python 3.7.17
ElasticSearch version
7.16.3
Installed Firefox version
firefox 99.0
MongoDB version
MongoDB 4.4.29
PhantomJS version
2.1.1
Redis version
redis-server 7.2.5
Pre-installed Go versions
1.11.1
mvn version
Apache Maven 3.9.4 (dfbb324ad4a7c8fb0bf182e6d91b0ae20e3d2dd9)
gradle version
Gradle 8.3!
lein version
Leiningen 2.11.2 on Java 11.0.21 OpenJDK 64-Bit Server VM
Pre-installed Node.js versions
v10.24.1
v12.22.12
v14.21.3
v16.15
v16.20.2
v18.20.3
v20.14.0
v4.9.1
v6.17.1
v8.17.0
phpenv versions
  system
  7.4
* 7.4.6 (set by /home/travis/.phpenv/version)
  hhvm-stable
  hhvm
composer --version
Composer version 1.10.6 2020-05-06 10:28:10
Pre-installed Ruby versions
ruby-2.5.9
ruby-2.7.6
ruby-3.3.0
travis_fold:end:system_info

travis_time:end:0333cf6e:start=1720562092284739425,finish=1720562092291273445,duration=6534020,event=show_system_info
travis_time:start:02fafc5b
travis_time:end:02fafc5b:start=1720562092294545998,finish=1720562092314620417,duration=20074419,event=rm_riak_source
travis_time:start:05de0c14
travis_time:end:05de0c14:start=1720562092318046616,finish=1720562092323708624,duration=5662008,event=fix_rwky_redis
travis_time:start:0437fd9c
travis_time:end:0437fd9c:start=1720562092327319182,finish=1720562092700327109,duration=373007927,event=wait_for_network
travis_time:start:1e883c80
cp: cannot create regular file '/etc/apt/trusted.gpg.d/apt.llvm.org.asc~': Permission denied
travis_time:end:1e883c80:start=1720562092703268808,finish=1720562092902858803,duration=199589995,event=update_apt_keys
travis_time:start:06be25c7
travis_time:end:06be25c7:start=1720562092905692626,finish=1720562092959943848,duration=54251222,event=fix_hhvm_source
travis_time:start:16222a9d
travis_time:end:16222a9d:start=1720562092963206519,finish=1720562092988913625,duration=25707106,event=update_mongo_arch
travis_time:start:05bc9026
travis_time:end:05bc9026:start=1720562092991530617,finish=1720562093025136660,duration=33606043,event=fix_sudo_enabled_trusty
travis_time:start:02bda920
travis_time:end:02bda920:start=1720562093027804461,finish=1720562093029734266,duration=1929805,event=update_glibc
travis_time:start:12ab5b5f
travis_time:end:12ab5b5f:start=1720562093032332052,finish=1720562093063252189,duration=30920137,event=clean_up_path
travis_time:start:0d0c01a9
travis_time:end:0d0c01a9:start=1720562093065956515,finish=1720562093076460239,duration=10503724,event=fix_resolv_conf
travis_time:start:07572afe
travis_time:end:07572afe:start=1720562093079076209,finish=1720562093104393905,duration=25317696,event=fix_etc_hosts
travis_time:start:2eeca644
travis_time:end:2eeca644:start=1720562093107032383,finish=1720562093114058218,duration=7025835,event=fix_mvn_settings_xml
travis_time:start:0271a0f3
travis_time:end:0271a0f3:start=1720562093116680382,finish=1720562093126592610,duration=9912228,event=no_ipv6_localhost
travis_time:start:0d2f7615
travis_time:end:0d2f7615:start=1720562093129171941,finish=1720562093131155818,duration=1983877,event=fix_etc_mavenrc
travis_time:start:099068df
OK
travis_time:end:099068df:start=1720562093133762025,finish=1720562093630888150,duration=497126125,event=fix_perforce_key
travis_time:start:061f6e10
travis_time:end:061f6e10:start=1720562093633671834,finish=1720562093636558015,duration=2886181,event=fix_wwdr_certificate
travis_time:start:178dd6ed
travis_time:end:178dd6ed:start=1720562093639228543,finish=1720562093684056513,duration=44827970,event=put_localhost_first
travis_time:start:0a7d0980
travis_time:end:0a7d0980:start=1720562093686679927,finish=1720562093689228579,duration=2548652,event=home_paths
travis_time:start:03292518
travis_time:end:03292518:start=1720562093692241807,finish=1720562093705058679,duration=12816872,event=disable_initramfs
travis_time:start:2290c8ce
travis_time:end:2290c8ce:start=1720562093707843298,finish=1720562093843943728,duration=136100430,event=disable_ssh_roaming
travis_time:start:2bc2e3cf
travis_time:end:2bc2e3cf:start=1720562093846657684,finish=1720562093848593615,duration=1935931,event=debug_tools
travis_time:start:04bb2b34
travis_time:end:04bb2b34:start=1720562093851191999,finish=1720562093853915181,duration=2723182,event=uninstall_oclint
travis_time:start:1dc87ad2
travis_time:end:1dc87ad2:start=1720562093856512309,finish=1720562093859074371,duration=2562062,event=rvm_use
travis_time:start:1ff66d00
travis_time:end:1ff66d00:start=1720562093861683506,finish=1720562093869199106,duration=7515600,event=rm_etc_boto_cfg
travis_time:start:151f8985
travis_time:end:151f8985:start=1720562093871931548,finish=1720562093873893585,duration=1962037,event=rm_oraclejdk8_symlink
travis_time:start:29fddc74
travis_time:end:29fddc74:start=1720562093876628630,finish=1720562094001126471,duration=124497841,event=enable_i386
travis_time:start:19634fd0
travis_time:end:19634fd0:start=1720562094004035009,finish=1720562094007705386,duration=3670377,event=update_rubygems
travis_time:start:1eea9aec
travis_time:end:1eea9aec:start=1720562094010479088,finish=1720562094923883833,duration=913404745,event=ensure_path_components
travis_time:start:21f9d620
travis_time:end:21f9d620:start=1720562094927004945,finish=1720562094929095839,duration=2090894,event=redefine_curl
travis_time:start:12158a42
travis_time:end:12158a42:start=1720562094931806173,finish=1720562094933818675,duration=2012502,event=nonblock_pipe
travis_time:start:0e3ba214
travis_time:end:0e3ba214:start=1720562094936515875,finish=1720562100972807851,duration=6036291976,event=apt_get_update
travis_time:start:09742386
travis_time:end:09742386:start=1720562100976386554,finish=1720562100978543985,duration=2157431,event=deprecate_xcode_64
travis_time:start:160c081e
travis_time:end:160c081e:start=1720562100981246797,finish=1720562104798644086,duration=3817397289,event=update_heroku
travis_time:start:12df5450
travis_time:end:12df5450:start=1720562104801658836,finish=1720562104803968648,duration=2309812,event=shell_session_update
travis_time:start:01899f14
travis_fold:start:docker_mtu_and_registry_mirrors
travis_fold:end:docker_mtu_and_registry_mirrors
travis_time:end:01899f14:start=1720562104806732449,finish=1720562106749671584,duration=1942939135,event=set_docker_mtu_and_registry_mirrors
travis_time:start:189a8b94
travis_fold:start:resolvconf
travis_fold:end:resolvconf
travis_time:end:189a8b94:start=1720562106752649643,finish=1720562106808397456,duration=55747813,event=resolvconf
travis_time:start:02ed42f0
travis_time:end:02ed42f0:start=1720562106811291343,finish=1720562106980429864,duration=169138521,event=maven_central_mirror
travis_time:start:32f7b6a6
travis_time:end:32f7b6a6:start=1720562106983706739,finish=1720562107093284913,duration=109578174,event=maven_https

travis_fold:start:install_jdk
Installing openjdk11
travis_fold:end:install_jdk
travis_time:start:2c48e4ce
travis_time:end:2c48e4ce:start=1720562107100606429,finish=1720562107102945059,duration=2338630,event=fix_ps4
travis_time:start:010f0fae

travis_fold:start:git.checkout
travis_time:start:02be63ca
travis_time:end:02be63ca:start=1720562107109038807,finish=1720562107117833436,duration=8794629,event=checkout
travis_time:start:0a290b8c
$ git clone --depth=50 --branch=mkd-lang-test https://github.com/mkdtravis/travis-tests.git mkdtravis/travis-tests
Cloning into 'mkdtravis/travis-tests'...
remote: Enumerating objects: 50, done.
remote: Counting objects:   5% (1/18)
remote: Counting objects:  11% (2/18)
remote: Counting objects:  16% (3/18)
remote: Counting objects:  22% (4/18)
remote: Counting objects:  27% (5/18)
remote: Counting objects:  33% (6/18)
remote: Counting objects:  38% (7/18)
remote: Counting objects:  44% (8/18)
remote: Counting objects:  50% (9/18)
remote: Counting objects:  55% (10/18)
remote: Counting objects:  61% (11/18)
remote: Counting objects:  66% (12/18)
remote: Counting objects:  72% (13/18)
remote: Counting objects:  77% (14/18)
remote: Counting objects:  83% (15/18)
remote: Counting objects:  88% (16/18)
remote: Counting objects:  94% (17/18)
remote: Counting objects: 100% (18/18)
remote: Counting objects: 100% (18/18), done.
remote: Compressing objects:   5% (1/18)
remote: Compressing objects:  11% (2/18)
remote: Compressing objects:  16% (3/18)
remote: Compressing objects:  22% (4/18)
remote: Compressing objects:  27% (5/18)
remote: Compressing objects:  33% (6/18)
remote: Compressing objects:  38% (7/18)
remote: Compressing objects:  44% (8/18)
remote: Compressing objects:  50% (9/18)
remote: Compressing objects:  55% (10/18)
remote: Compressing objects:  61% (11/18)
remote: Compressing objects:  66% (12/18)
remote: Compressing objects:  72% (13/18)
remote: Compressing objects:  77% (14/18)
remote: Compressing objects:  83% (15/18)
remote: Compressing objects:  88% (16/18)
remote: Compressing objects:  94% (17/18)
remote: Compressing objects: 100% (18/18)
remote: Compressing objects: 100% (18/18), done.
Receiving objects:   2% (1/50)
Receiving objects:   4% (2/50)
Receiving objects:   6% (3/50)
Receiving objects:   8% (4/50)
Receiving objects:  10% (5/50)
Receiving objects:  12% (6/50)
Receiving objects:  14% (7/50)
Receiving objects:  16% (8/50)
Receiving objects:  18% (9/50)
Receiving objects:  20% (10/50)
Receiving objects:  22% (11/50)
Receiving objects:  24% (12/50)
Receiving objects:  26% (13/50)
Receiving objects:  28% (14/50)
Receiving objects:  30% (15/50)
Receiving objects:  32% (16/50)
Receiving objects:  34% (17/50)
Receiving objects:  36% (18/50)
Receiving objects:  38% (19/50)
Receiving objects:  40% (20/50)
Receiving objects:  42% (21/50)
Receiving objects:  44% (22/50)
Receiving objects:  46% (23/50)
Receiving objects:  48% (24/50)
remote: Total 50 (delta 4), reused 0 (delta 0), pack-reused 32
Receiving objects:  50% (25/50)
Receiving objects:  52% (26/50)
Receiving objects:  54% (27/50)
Receiving objects:  56% (28/50)
Receiving objects:  58% (29/50)
Receiving objects:  60% (30/50)
Receiving objects:  62% (31/50)
Receiving objects:  64% (32/50)
Receiving objects:  66% (33/50)
Receiving objects:  68% (34/50)
Receiving objects:  70% (35/50)
Receiving objects:  72% (36/50)
Receiving objects:  74% (37/50)
Receiving objects:  76% (38/50)
Receiving objects:  78% (39/50)
Receiving objects:  80% (40/50)
Receiving objects:  82% (41/50)
Receiving objects:  84% (42/50)
Receiving objects:  86% (43/50)
Receiving objects:  88% (44/50)
Receiving objects:  90% (45/50)
Receiving objects:  92% (46/50)
Receiving objects:  94% (47/50)
Receiving objects:  96% (48/50)
Receiving objects:  98% (49/50)
Receiving objects: 100% (50/50)
Receiving objects: 100% (50/50), 15.72 KiB | 3.14 MiB/s, done.
Resolving deltas:   0% (0/12)
Resolving deltas:   8% (1/12)
Resolving deltas:  16% (2/12)
Resolving deltas:  25% (3/12)
Resolving deltas:  33% (4/12)
Resolving deltas:  41% (5/12)
Resolving deltas:  50% (6/12)
Resolving deltas:  58% (7/12)
Resolving deltas:  66% (8/12)
Resolving deltas:  75% (9/12)
Resolving deltas:  83% (10/12)
Resolving deltas:  91% (11/12)
Resolving deltas: 100% (12/12)
Resolving deltas: 100% (12/12), done.
travis_time:end:0a290b8c:start=1720562107120886654,finish=1720562107365315165,duration=244428511,event=checkout
$ cd mkdtravis/travis-tests
$ git checkout -qf 82b2d4b441796b4a77a9888bfbb9a469885916e8
travis_fold:end:git.checkout

travis_time:end:0a290b8c:start=1720562107120886654,finish=1720562107371197955,duration=250311301,event=checkout
travis_time:start:004a21eb
travis_time:end:004a21eb:start=1720562107374349354,finish=1720562107376594075,duration=2244721,event=env
travis_fold:start:cache.1
Setting up build cache
$ export CASHER_DIR=${TRAVIS_HOME}/.casher
travis_time:start:032b8d22
$ Installing caching utilities
travis_time:end:032b8d22:start=1720562108123025858,finish=1720562108170540260,duration=47514402,event=setup_casher
travis_time:start:013ec270
travis_time:end:013ec270:start=1720562108175722296,finish=1720562108178815154,duration=3092858,event=setup_casher
travis_time:start:0ab4fbb4
attempting to download cache archive
fetching mkd-lang-test/cache--linux-focal-e3b0c44298fc1c149afbf4c8996fb92427ae41e4649b934ca495991b7852b855--jdk-openjdk11.tgz
fetching mkd-lang-test/cache-linux-focal-e3b0c44298fc1c149afbf4c8996fb92427ae41e4649b934ca495991b7852b855--jdk-openjdk11.tgz
fetching mkd-lang-test/cache--jdk-openjdk11.tgz
fetching main/cache--linux-focal-e3b0c44298fc1c149afbf4c8996fb92427ae41e4649b934ca495991b7852b855--jdk-openjdk11.tgz
fetching main/cache-linux-focal-e3b0c44298fc1c149afbf4c8996fb92427ae41e4649b934ca495991b7852b855--jdk-openjdk11.tgz
fetching main/cache--jdk-openjdk11.tgz
could not download cache
travis_time:end:0ab4fbb4:start=1720562108182833030,finish=1720562110104651508,duration=1921818478,event=setup_casher
travis_time:start:009cb487
travis_time:end:009cb487:start=1720562110108866732,finish=1720562110112095917,duration=3229185,event=setup_casher
travis_time:start:0eb6c8f0
adding /home/travis/.m2 to cache
adding /home/travis/.npm to cache
adding /home/travis/.cache/pip to cache
travis_time:end:0eb6c8f0:start=1720562110116297202,finish=1720562111393876308,duration=1277579106,event=setup_casher
travis_fold:end:cache.1

$ java -Xmx32m -version
openjdk version "11.0.21" 2023-10-17 LTS
OpenJDK Runtime Environment (build 11.0.21+10-LTS)
OpenJDK 64-Bit Server VM (build 11.0.21+10-LTS, mixed mode)
$ javac -J-Xmx32m -version
javac 11.0.21
travis_fold:start:install
travis_time:start:0df2b550
$ mvn install
[INFO] Scanning for projects...
[INFO] ------------------------------------------------------------------------
[INFO] BUILD FAILURE
[INFO] ------------------------------------------------------------------------
[INFO] Total time:  0.120 s
[INFO] Finished at: 2024-07-09T21:55:14Z
[INFO] ------------------------------------------------------------------------
[ERROR] The goal you specified requires a project to execute but there is no POM in this directory (/home/travis/build/mkdtravis/travis-tests). Please verify you invoked Maven from the correct directory. -> [Help 1]
[ERROR] 
[ERROR] To see the full stack trace of the errors, re-run Maven with the -e switch.
[ERROR] Re-run Maven using the -X switch to enable full debug logging.
[ERROR] 
[ERROR] For more information about the errors and possible solutions, please read the following articles:
[ERROR] [Help 1] http://cwiki.apache.org/confluence/display/MAVEN/MissingProjectException
travis_time:end:0df2b550:start=1720562111932410524,finish=1720562114406376518,duration=2473965994,event=install
The command "mvn install" failed and exited with 1 during .

Your build has been stopped.