travis_fold:start:worker_info
Worker information
hostname: c144faaf-7b2e-4c3c-92d5-a79aa73bf1a3@1.worker-com-oss-6ff4ffc9b7-tl2fj.gce-production-3
version: v6.2.24 https://github.com/travis-ci/worker/tree/ee57d650a7692c1ac03f74ac073d0fd150c9f030
instance: travis-job-cf4e805a-54d7-4c8a-aa69-c10a3a622c6b travis-ci-ubuntu-2004-1718191197-38d8975c (via amqp)
startup: 6.088845868s
travis_fold:end:worker_info
travis_time:start:06d7bd76
travis_time:end:06d7bd76:start=1720562091653595943,finish=1720562091960319901,duration=306723958,event=no_world_writable_dirs
travis_time:start:00b28166
travis_time:end:00b28166:start=1720562091963400399,finish=1720562091970672285,duration=7271886,event=agent
travis_time:start:088e879b
travis_time:end:088e879b:start=1720562091973439345,finish=1720562091975521493,duration=2082148,event=check_unsupported
travis_time:start:1e22c5c3
travis_fold:start:system_info
Build system information
Build language: java
Build dist: focal
Build id: 271349067
Job id: 623872964
Runtime kernel version: 5.15.0-1062-gcp
travis-build version: 3484ecfe
Build image provisioning date and time
Wed 12 Jun 2024 11:42:45 AM UTC
Operating System Details
Distributor ID:	Ubuntu
Description:	Ubuntu 20.04.6 LTS
Release:	20.04
Codename:	focal
Systemd Version
systemd 245 (245.4-4ubuntu3.23)
Cookbooks Version
41af193 https://github.com/travis-ci/travis-cookbooks/tree/41af193
git version
git version 2.45.2
bash version
GNU bash, version 5.0.17(1)-release (x86_64-pc-linux-gnu)
gcc version
gcc (Ubuntu 9.4.0-1ubuntu1~20.04.2) 9.4.0
docker version
Client:
 Version:           24.0.7
 API version:       1.43
 Go version:        go1.21.1
 Git commit:        24.0.7-0ubuntu2~20.04.1
 Built:             Wed Mar 13 20:29:24 2024
 OS/Arch:           linux/amd64
 Context:           default

Server:
 Engine:
  Version:          24.0.7
  API version:      1.43 (minimum version 1.12)
  Go version:       go1.21.1
  Git commit:       24.0.7-0ubuntu2~20.04.1
  Built:            Wed Mar 13 20:29:24 2024
  OS/Arch:          linux/amd64
  Experimental:     false
 containerd:
  Version:          1.7.12
  GitCommit:        
 runc:
  Version:          1.1.12-0ubuntu2~20.04.1
  GitCommit:        
 docker-init:
  Version:          0.19.0
  GitCommit:        
clang version
clang version 16.0.0
jq version
jq-1.7.1
bats version
Bats 1.11.0
shellcheck version
0.10.0
shfmt version
v3.8.0
ccache version
3.7.7
cmake version
cmake version 3.29.0
heroku version
heroku/8.11.5 linux-x64 node-v16.20.2
imagemagick version
Version: ImageMagick 6.9.10-23 Q16 x86_64 20190101 https://imagemagick.org
md5deep version
4.4
mercurial version
version 6.5.2
mysql version
mysql  Ver 8.0.37-0ubuntu0.20.04.3 for Linux on x86_64 ((Ubuntu))
openssl version
OpenSSL 1.1.1f  31 Mar 2020
packer version
Packer v1.11.0
postgresql client version
psql (PostgreSQL) 13.15 (Ubuntu 13.15-1.pgdg20.04+1)
ragel version
Ragel State Machine Compiler version 6.10 March 2017
sudo version
1.8.31
gzip version
gzip 1.10
zip version
Zip 3.0
vim version
VIM - Vi IMproved 8.1 (2018 May 18, compiled May 03 2024 02:36:35)
iptables version
iptables v1.8.4 (legacy)
curl version
curl 7.68.0 (x86_64-pc-linux-gnu) libcurl/7.68.0 OpenSSL/1.1.1f zlib/1.2.11 brotli/1.0.7 libidn2/2.2.0 libpsl/0.21.0 (+libidn2/2.2.0) libssh/0.9.3/openssl/zlib nghttp2/1.40.0 librtmp/2.3
wget version
GNU Wget 1.20.3 built on linux-gnu.
rsync version
rsync  version 3.1.3  protocol version 31
gimme version
v1.5.4
nvm version
0.39.7
perlbrew version
/home/travis/perl5/perlbrew/bin/perlbrew  - App::perlbrew/0.95
phpenv version
rbenv 1.2.0
rvm version
rvm 1.29.12 (latest) by Michal Papis, Piotr Kuczynski, Wayne E. Seguin [https://rvm.io]
default ruby version
ruby 3.3.0 (2023-12-25 revision 5124f9ac75) [x86_64-linux]
default python version
Python 3.7.17
ElasticSearch version
7.16.3
Installed Firefox version
firefox 99.0
MongoDB version
MongoDB 4.4.29
PhantomJS version
2.1.1
Redis version
redis-server 7.2.5
Pre-installed Go versions
1.11.1
mvn version
Apache Maven 3.9.4 (dfbb324ad4a7c8fb0bf182e6d91b0ae20e3d2dd9)
gradle version
Gradle 8.3!
lein version
Leiningen 2.11.2 on Java 11.0.21 OpenJDK 64-Bit Server VM
Pre-installed Node.js versions
v10.24.1
v12.22.12
v14.21.3
v16.15
v16.20.2
v18.20.3
v20.14.0
v4.9.1
v6.17.1
v8.17.0
phpenv versions
  system
  7.4
* 7.4.6 (set by /home/travis/.phpenv/version)
  hhvm-stable
  hhvm
composer --version
Composer version 1.10.6 2020-05-06 10:28:10
Pre-installed Ruby versions
ruby-2.5.9
ruby-2.7.6
ruby-3.3.0
travis_fold:end:system_info

travis_time:end:1e22c5c3:start=1720562091978309842,finish=1720562091995551203,duration=17241361,event=show_system_info
travis_time:start:0b430719
travis_time:end:0b430719:start=1720562091998391936,finish=1720562092016400349,duration=18008413,event=rm_riak_source
travis_time:start:0aec7c48
travis_time:end:0aec7c48:start=1720562092019515629,finish=1720562092024832993,duration=5317364,event=fix_rwky_redis
travis_time:start:00c3ba4e
travis_time:end:00c3ba4e:start=1720562092027880595,finish=1720562092393114795,duration=365234200,event=wait_for_network
travis_time:start:37888110
cp: cannot create regular file '/etc/apt/trusted.gpg.d/apt.llvm.org.asc~': Permission denied
travis_time:end:37888110:start=1720562092396396768,finish=1720562092598718946,duration=202322178,event=update_apt_keys
travis_time:start:1c719e08
travis_time:end:1c719e08:start=1720562092601491313,finish=1720562092655077404,duration=53586091,event=fix_hhvm_source
travis_time:start:0bd563f8
travis_time:end:0bd563f8:start=1720562092657770174,finish=1720562092669778264,duration=12008090,event=update_mongo_arch
travis_time:start:008abe08
travis_time:end:008abe08:start=1720562092672627813,finish=1720562092709094698,duration=36466885,event=fix_sudo_enabled_trusty
travis_time:start:0e154c81
travis_time:end:0e154c81:start=1720562092712068333,finish=1720562092714303713,duration=2235380,event=update_glibc
travis_time:start:1d3eacbe
travis_time:end:1d3eacbe:start=1720562092717124958,finish=1720562092743839036,duration=26714078,event=clean_up_path
travis_time:start:254c3107
travis_time:end:254c3107:start=1720562092746713299,finish=1720562092758296688,duration=11583389,event=fix_resolv_conf
travis_time:start:0248cf40
travis_time:end:0248cf40:start=1720562092761139473,finish=1720562092775152466,duration=14012993,event=fix_etc_hosts
travis_time:start:07581009
travis_time:end:07581009:start=1720562092778307529,finish=1720562092785181331,duration=6873802,event=fix_mvn_settings_xml
travis_time:start:078e0460
travis_time:end:078e0460:start=1720562092787811787,finish=1720562092797423340,duration=9611553,event=no_ipv6_localhost
travis_time:start:06c941e8
travis_time:end:06c941e8:start=1720562092800020424,finish=1720562092802062696,duration=2042272,event=fix_etc_mavenrc
travis_time:start:0515cdea
OK
travis_time:end:0515cdea:start=1720562092804653601,finish=1720562093314241152,duration=509587551,event=fix_perforce_key
travis_time:start:1a902fc8
travis_time:end:1a902fc8:start=1720562093317040780,finish=1720562093319634883,duration=2594103,event=fix_wwdr_certificate
travis_time:start:2fbdefe1
travis_time:end:2fbdefe1:start=1720562093322296021,finish=1720562093367066447,duration=44770426,event=put_localhost_first
travis_time:start:00f3492b
travis_time:end:00f3492b:start=1720562093369764392,finish=1720562093372163194,duration=2398802,event=home_paths
travis_time:start:295201f2
travis_time:end:295201f2:start=1720562093374837409,finish=1720562093387165886,duration=12328477,event=disable_initramfs
travis_time:start:2428fd4c
travis_time:end:2428fd4c:start=1720562093389782026,finish=1720562093523289964,duration=133507938,event=disable_ssh_roaming
travis_time:start:0d12bd98
travis_time:end:0d12bd98:start=1720562093526025363,finish=1720562093527984201,duration=1958838,event=debug_tools
travis_time:start:1250cd1b
travis_time:end:1250cd1b:start=1720562093530610812,finish=1720562093533681113,duration=3070301,event=uninstall_oclint
travis_time:start:223e4844
travis_time:end:223e4844:start=1720562093536569145,finish=1720562093539562855,duration=2993710,event=rvm_use
travis_time:start:11777251
travis_time:end:11777251:start=1720562093542471683,finish=1720562093550644527,duration=8172844,event=rm_etc_boto_cfg
travis_time:start:09ace416
travis_time:end:09ace416:start=1720562093553247616,finish=1720562093555159994,duration=1912378,event=rm_oraclejdk8_symlink
travis_time:start:06145ec0
travis_time:end:06145ec0:start=1720562093557756560,finish=1720562093675700729,duration=117944169,event=enable_i386
travis_time:start:00f09c6c
travis_time:end:00f09c6c:start=1720562093678510903,finish=1720562093682040894,duration=3529991,event=update_rubygems
travis_time:start:1d909fa3
travis_time:end:1d909fa3:start=1720562093684682868,finish=1720562094571055896,duration=886373028,event=ensure_path_components
travis_time:start:04256328
travis_time:end:04256328:start=1720562094574084668,finish=1720562094576109493,duration=2024825,event=redefine_curl
travis_time:start:0986b12c
travis_time:end:0986b12c:start=1720562094578741972,finish=1720562094580659733,duration=1917761,event=nonblock_pipe
travis_time:start:05318676
travis_time:end:05318676:start=1720562094583329402,finish=1720562100616171204,duration=6032841802,event=apt_get_update
travis_time:start:04abd544
travis_time:end:04abd544:start=1720562100619560129,finish=1720562100621591329,duration=2031200,event=deprecate_xcode_64
travis_time:start:015b466c
travis_time:end:015b466c:start=1720562100624192161,finish=1720562104359547972,duration=3735355811,event=update_heroku
travis_time:start:0f5557df
travis_time:end:0f5557df:start=1720562104362645116,finish=1720562104364657335,duration=2012219,event=shell_session_update
travis_time:start:27694800
travis_fold:start:docker_mtu_and_registry_mirrors
travis_fold:end:docker_mtu_and_registry_mirrors
travis_time:end:27694800:start=1720562104367377400,finish=1720562106376147310,duration=2008769910,event=set_docker_mtu_and_registry_mirrors
travis_time:start:10c90308
travis_fold:start:resolvconf
travis_fold:end:resolvconf
travis_time:end:10c90308:start=1720562106379623686,finish=1720562106435752886,duration=56129200,event=resolvconf
travis_time:start:0a1bdaf5
travis_time:end:0a1bdaf5:start=1720562106438984291,finish=1720562106619882459,duration=180898168,event=maven_central_mirror
travis_time:start:047843b8
travis_time:end:047843b8:start=1720562106623154051,finish=1720562106740092547,duration=116938496,event=maven_https

travis_fold:start:install_jdk
Installing openjdk8
travis_fold:end:install_jdk
travis_time:start:10782ffc
travis_time:end:10782ffc:start=1720562106750368245,finish=1720562106752856722,duration=2488477,event=fix_ps4
travis_time:start:07e4935f

travis_fold:start:git.checkout
travis_time:start:049d7a20
travis_time:end:049d7a20:start=1720562106759256227,finish=1720562106771924809,duration=12668582,event=checkout
travis_time:start:0f21ecf8
$ git clone --depth=50 --branch=mkd-lang-test https://github.com/mkdtravis/travis-tests.git mkdtravis/travis-tests
Cloning into 'mkdtravis/travis-tests'...
remote: Enumerating objects: 50, done.
remote: Counting objects:   5% (1/18)
remote: Counting objects:  11% (2/18)
remote: Counting objects:  16% (3/18)
remote: Counting objects:  22% (4/18)
remote: Counting objects:  27% (5/18)
remote: Counting objects:  33% (6/18)
remote: Counting objects:  38% (7/18)
remote: Counting objects:  44% (8/18)
remote: Counting objects:  50% (9/18)
remote: Counting objects:  55% (10/18)
remote: Counting objects:  61% (11/18)
remote: Counting objects:  66% (12/18)
remote: Counting objects:  72% (13/18)
remote: Counting objects:  77% (14/18)
remote: Counting objects:  83% (15/18)
remote: Counting objects:  88% (16/18)
remote: Counting objects:  94% (17/18)
remote: Counting objects: 100% (18/18)
remote: Counting objects: 100% (18/18), done.
remote: Compressing objects:   5% (1/18)
remote: Compressing objects:  11% (2/18)
remote: Compressing objects:  16% (3/18)
remote: Compressing objects:  22% (4/18)
remote: Compressing objects:  27% (5/18)
remote: Compressing objects:  33% (6/18)
remote: Compressing objects:  38% (7/18)
remote: Compressing objects:  44% (8/18)
remote: Compressing objects:  50% (9/18)
remote: Compressing objects:  55% (10/18)
remote: Compressing objects:  61% (11/18)
remote: Compressing objects:  66% (12/18)
remote: Compressing objects:  72% (13/18)
remote: Compressing objects:  77% (14/18)
remote: Compressing objects:  83% (15/18)
remote: Compressing objects:  88% (16/18)
remote: Compressing objects:  94% (17/18)
remote: Compressing objects: 100% (18/18)
remote: Compressing objects: 100% (18/18), done.
Receiving objects:   2% (1/50)
Receiving objects:   4% (2/50)
Receiving objects:   6% (3/50)
Receiving objects:   8% (4/50)
Receiving objects:  10% (5/50)
Receiving objects:  12% (6/50)
Receiving objects:  14% (7/50)
Receiving objects:  16% (8/50)
Receiving objects:  18% (9/50)
Receiving objects:  20% (10/50)
Receiving objects:  22% (11/50)
Receiving objects:  24% (12/50)
Receiving objects:  26% (13/50)
Receiving objects:  28% (14/50)
Receiving objects:  30% (15/50)
Receiving objects:  32% (16/50)
Receiving objects:  34% (17/50)
Receiving objects:  36% (18/50)
Receiving objects:  38% (19/50)
Receiving objects:  40% (20/50)
Receiving objects:  42% (21/50)
Receiving objects:  44% (22/50)
Receiving objects:  46% (23/50)
Receiving objects:  48% (24/50)
remote: Total 50 (delta 4), reused 0 (delta 0), pack-reused 32
Receiving objects:  50% (25/50)
Receiving objects:  52% (26/50)
Receiving objects:  54% (27/50)
Receiving objects:  56% (28/50)
Receiving objects:  58% (29/50)
Receiving objects:  60% (30/50)
Receiving objects:  62% (31/50)
Receiving objects:  64% (32/50)
Receiving objects:  66% (33/50)
Receiving objects:  68% (34/50)
Receiving objects:  70% (35/50)
Receiving objects:  72% (36/50)
Receiving objects:  74% (37/50)
Receiving objects:  76% (38/50)
Receiving objects:  78% (39/50)
Receiving objects:  80% (40/50)
Receiving objects:  82% (41/50)
Receiving objects:  84% (42/50)
Receiving objects:  86% (43/50)
Receiving objects:  88% (44/50)
Receiving objects:  90% (45/50)
Receiving objects:  92% (46/50)
Receiving objects:  94% (47/50)
Receiving objects:  96% (48/50)
Receiving objects:  98% (49/50)
Receiving objects: 100% (50/50)
Receiving objects: 100% (50/50), 15.72 KiB | 5.24 MiB/s, done.
Resolving deltas:   0% (0/12)
Resolving deltas:   8% (1/12)
Resolving deltas:  16% (2/12)
Resolving deltas:  25% (3/12)
Resolving deltas:  33% (4/12)
Resolving deltas:  41% (5/12)
Resolving deltas:  50% (6/12)
Resolving deltas:  58% (7/12)
Resolving deltas:  66% (8/12)
Resolving deltas:  75% (9/12)
Resolving deltas:  83% (10/12)
Resolving deltas:  91% (11/12)
Resolving deltas: 100% (12/12)
Resolving deltas: 100% (12/12), done.
travis_time:end:0f21ecf8:start=1720562106775135382,finish=1720562107007717089,duration=232581707,event=checkout
$ cd mkdtravis/travis-tests
$ git checkout -qf 82b2d4b441796b4a77a9888bfbb9a469885916e8
travis_fold:end:git.checkout

travis_time:end:0f21ecf8:start=1720562106775135382,finish=1720562107013311604,duration=238176222,event=checkout
travis_time:start:027ba61e
travis_time:end:027ba61e:start=1720562107016285393,finish=1720562107018524573,duration=2239180,event=env
travis_fold:start:cache.1
Setting up build cache
$ export CASHER_DIR=${TRAVIS_HOME}/.casher
travis_time:start:04dbaceb
$ Installing caching utilities
travis_time:end:04dbaceb:start=1720562107771390018,finish=1720562107797249239,duration=25859221,event=setup_casher
travis_time:start:0f5d8844
travis_time:end:0f5d8844:start=1720562107802219721,finish=1720562107805215844,duration=2996123,event=setup_casher
travis_time:start:22b79aa0
attempting to download cache archive
fetching mkd-lang-test/cache--linux-focal-e3b0c44298fc1c149afbf4c8996fb92427ae41e4649b934ca495991b7852b855--jdk-openjdk8.tgz
fetching mkd-lang-test/cache-linux-focal-e3b0c44298fc1c149afbf4c8996fb92427ae41e4649b934ca495991b7852b855--jdk-openjdk8.tgz
fetching mkd-lang-test/cache--jdk-openjdk8.tgz
fetching main/cache--linux-focal-e3b0c44298fc1c149afbf4c8996fb92427ae41e4649b934ca495991b7852b855--jdk-openjdk8.tgz
fetching main/cache-linux-focal-e3b0c44298fc1c149afbf4c8996fb92427ae41e4649b934ca495991b7852b855--jdk-openjdk8.tgz
fetching main/cache--jdk-openjdk8.tgz
could not download cache
travis_time:end:22b79aa0:start=1720562107809180858,finish=1720562109432335960,duration=1623155102,event=setup_casher
travis_time:start:1f4b7d60
travis_time:end:1f4b7d60:start=1720562109436903812,finish=1720562109440184012,duration=3280200,event=setup_casher
travis_time:start:3a851da0
adding /home/travis/.m2 to cache
adding /home/travis/.npm to cache
adding /home/travis/.cache/pip to cache
travis_time:end:3a851da0:start=1720562109444294382,finish=1720562110761558303,duration=1317263921,event=setup_casher
travis_fold:end:cache.1

$ java -Xmx32m -version
openjdk version "1.8.0_392"
OpenJDK Runtime Environment (build 1.8.0_392-b09)
OpenJDK 64-Bit Server VM (build 25.392-b09, mixed mode)
$ javac -J-Xmx32m -version
javac 1.8.0_392
travis_fold:start:install
travis_time:start:1f9d2bcc
$ mvn install
[INFO] Scanning for projects...
[INFO] ------------------------------------------------------------------------
[INFO] BUILD FAILURE
[INFO] ------------------------------------------------------------------------
[INFO] Total time:  0.104 s
[INFO] Finished at: 2024-07-09T21:55:13Z
[INFO] ------------------------------------------------------------------------
[ERROR] The goal you specified requires a project to execute but there is no POM in this directory (/home/travis/build/mkdtravis/travis-tests). Please verify you invoked Maven from the correct directory. -> [Help 1]
[ERROR] 
[ERROR] To see the full stack trace of the errors, re-run Maven with the -e switch.
[ERROR] Re-run Maven using the -X switch to enable full debug logging.
[ERROR] 
[ERROR] For more information about the errors and possible solutions, please read the following articles:
[ERROR] [Help 1] http://cwiki.apache.org/confluence/display/MAVEN/MissingProjectException
travis_time:end:1f9d2bcc:start=1720562111328238889,finish=1720562113341296346,duration=2013057457,event=install
The command "mvn install" failed and exited with 1 during .

Your build has been stopped.