travis_fold:start:worker_info
Worker information
hostname: d1520ec4-9b1d-4316-8f07-09e95b53b0cb@1.worker-n2-com-779d777f7b-rxlft.gce-production-1
version: 6.2.22 https://github.com/travis-ci/worker/tree/858cb91994a513269f2fe9782c15fc113e966231
instance: travis-job-ea81c3f8-6adf-4753-8d93-aafee221d2dc travis-ci-sardonyx-xenial-1684402799-0876f6f0 (via amqp)
startup: 8.41659669s
travis_fold:end:worker_info
travis_time:start:000f0aa0
travis_time:end:000f0aa0:start=1718879080454151415,finish=1718879080604118009,duration=149966594,event=no_world_writable_dirs
travis_time:start:3b3eaca0
travis_time:end:3b3eaca0:start=1718879080606781175,finish=1718879080610073887,duration=3292712,event=setup_filter
travis_time:start:19339960
travis_time:end:19339960:start=1718879080614288266,finish=1718879080621978388,duration=7690122,event=agent
travis_time:start:06309be8
travis_time:end:06309be8:start=1718879080625095270,finish=1718879080627196292,duration=2101022,event=check_unsupported
travis_time:start:14170ea8
travis_fold:start:system_info
Build system information
Build language: go
Build dist: xenial
Build id: 271051532
Job id: 623157654
Runtime kernel version: 4.15.0-1098-gcp
travis-build version: 3484ecfe
Build image provisioning date and time
Thu May 18 10:07:51 UTC 2023
Operating System Details
Distributor ID:	Ubuntu
Description:	Ubuntu 16.04.7 LTS
Release:	16.04
Codename:	xenial
Systemd Version
systemd 229
Cookbooks Version
d19e5ff https://github.com/travis-ci/travis-cookbooks/tree/d19e5ff
git version
git version 2.40.1
bash version
GNU bash, version 4.3.48(1)-release (x86_64-pc-linux-gnu)
gcc version
gcc (Ubuntu 5.4.0-6ubuntu1~16.04.12) 5.4.0 20160609
docker version
Client: Docker Engine - Community
 Version:           20.10.7
 API version:       1.41
 Go version:        go1.13.15
 Git commit:        f0df350
 Built:             Wed Jun  2 11:56:47 2021
 OS/Arch:           linux/amd64
 Context:           default
 Experimental:      true

Server: Docker Engine - Community
 Engine:
  Version:          20.10.7
  API version:      1.41 (minimum version 1.12)
  Go version:       go1.13.15
  Git commit:       b0f5bc3
  Built:            Wed Jun  2 11:54:58 2021
  OS/Arch:          linux/amd64
  Experimental:     false
 containerd:
  Version:          1.4.6
  GitCommit:        d71fcd7d8303cbf684402823e425e9dd2e99285d
 runc:
  Version:          1.0.0-rc95
  GitCommit:        b9ee9c6314599f1b4a7f497e1f1f856fe433d3b7
 docker-init:
  Version:          0.19.0
  GitCommit:        de40ad0
clang version
clang version 7.0.0 (tags/RELEASE_700/final)
jq version
jq-1.6
bats version
Bats 0.4.0
shellcheck version
0.7.2
shfmt version
v3.2.1
ccache version
3.2.4
cmake version
cmake version 3.26.3
heroku version
heroku/8.1.3 linux-x64 node-v16.19.0
imagemagick version
Version: ImageMagick 6.8.9-9 Q16 x86_64 2020-12-04 http://www.imagemagick.org
md5deep version
4.4
mercurial version
version 5.9.3
mysql version
mysql  Ver 14.14 Distrib 5.7.33, for Linux (x86_64) using  EditLine wrapper
openssl version
OpenSSL 1.0.2g  1 Mar 2016
packer version
1.7.5
postgresql client version
psql (PostgreSQL) 10.17 (Ubuntu 10.17-1.pgdg16.04+1)
ragel version
Ragel State Machine Compiler version 6.8 Feb 2013
sudo version
1.8.16
gzip version
gzip 1.6
zip version
Zip 3.0
vim version
VIM - Vi IMproved 7.4 (2013 Aug 10, compiled Oct 13 2020 16:04:38)
iptables version
iptables v1.6.0
curl version
curl 7.47.0 (x86_64-pc-linux-gnu) libcurl/7.47.0 GnuTLS/3.4.10 zlib/1.2.8 libidn/1.32 librtmp/2.3
wget version
GNU Wget 1.17.1 built on linux-gnu.
rsync version
rsync  version 3.1.1  protocol version 31
gimme version
v1.5.4
nvm version
0.39.3
perlbrew version
/home/travis/perl5/perlbrew/bin/perlbrew  - App::perlbrew/0.95
phpenv version
rbenv 1.2.0
rvm version
rvm 1.29.12 (latest) by Michal Papis, Piotr Kuczynski, Wayne E. Seguin [https://rvm.io]
default ruby version
ruby 2.7.6p219 (2022-04-12 revision c9c2245c0a) [x86_64-linux]
default python version
Python 3.7.13
CouchDB version
couchdb 1.6.1
ElasticSearch version
7.16.3
Installed Firefox version
firefox 63.0.1
MongoDB version
MongoDB 4.4.21
PhantomJS version
2.1.1
Pre-installed PostgreSQL versions
9.4.26
9.5.25
9.6.22
Redis version
redis-server 6.0.6
Pre-installed Go versions
1.18.4
ant version
Apache Ant(TM) version 1.9.6 compiled on July 20 2018
mvn version
Apache Maven 3.8.8 (4c87b05d9aedce574290d1acc98575ed5eb6cd39)
gradle version
Gradle 7.5.1!
lein version
Leiningen 2.10.0 on Java 11.0.15.1 OpenJDK 64-Bit Server VM
Pre-installed Node.js versions
v10.24.1
v12.22.12
v14.21.3
v16.15
v16.16.0
v16.20.0
v18.16.0
v4.9.1
v6.17.1
v8.17.0
phpenv versions
  system
  7.4
* 7.4.30 (set by /home/travis/.phpenv/version)
  hhvm-stable
  hhvm
composer --version
Composer version 2.3.7 2022-06-06 16:43:28
Pre-installed Ruby versions
ruby-2.7.6
ruby-3.0.4
ruby-3.1.2
travis_fold:end:system_info

travis_time:end:14170ea8:start=1718879080629889101,finish=1718879080639433997,duration=9544896,event=show_system_info
travis_time:start:1f44dbc0
travis_time:end:1f44dbc0:start=1718879080642159290,finish=1718879080654765445,duration=12606155,event=rm_riak_source
travis_time:start:0bd8e683
travis_time:end:0bd8e683:start=1718879080657810736,finish=1718879080667016320,duration=9205584,event=fix_rwky_redis
travis_time:start:04b638ec
travis_time:end:04b638ec:start=1718879080670046715,finish=1718879081910025997,duration=1239979282,event=wait_for_network
travis_time:start:01f96d4c
travis_time:end:01f96d4c:start=1718879081913962612,finish=1718879107798428001,duration=25884465389,event=update_apt_keys
travis_time:start:07b0adb8
travis_time:end:07b0adb8:start=1718879107803664718,finish=1718879107858788695,duration=55123977,event=fix_hhvm_source
travis_time:start:0c877404
travis_time:end:0c877404:start=1718879107864209249,finish=1718879107867297537,duration=3088288,event=update_mongo_arch
travis_time:start:02930cf4
travis_time:end:02930cf4:start=1718879107876529129,finish=1718879107919105371,duration=42576242,event=fix_sudo_enabled_trusty
travis_time:start:0a482f74
travis_time:end:0a482f74:start=1718879107928064655,finish=1718879107931511947,duration=3447292,event=update_glibc
travis_time:start:057d4625
travis_time:end:057d4625:start=1718879107936437238,finish=1718879107967083297,duration=30646059,event=clean_up_path
travis_time:start:2e2693a4
travis_time:end:2e2693a4:start=1718879107974768633,finish=1718879107983309054,duration=8540421,event=fix_resolv_conf
travis_time:start:1bc227c8
travis_time:end:1bc227c8:start=1718879107990767429,finish=1718879108000632004,duration=9864575,event=fix_etc_hosts
travis_time:start:0c13ffeb
travis_time:end:0c13ffeb:start=1718879108008230963,finish=1718879108016893088,duration=8662125,event=fix_mvn_settings_xml
travis_time:start:13255cfb
travis_time:end:13255cfb:start=1718879108020759740,finish=1718879108030562420,duration=9802680,event=no_ipv6_localhost
travis_time:start:093d5108
travis_time:end:093d5108:start=1718879108034444645,finish=1718879108037049481,duration=2604836,event=fix_etc_mavenrc
travis_time:start:075edc54
OK
travis_time:end:075edc54:start=1718879108042408856,finish=1718879108375605001,duration=333196145,event=fix_perforce_key
travis_time:start:0055e385
travis_time:end:0055e385:start=1718879108380969599,finish=1718879108385076578,duration=4106979,event=fix_wwdr_certificate
travis_time:start:0e0dce8a
travis_time:end:0e0dce8a:start=1718879108390704864,finish=1718879108416090503,duration=25385639,event=put_localhost_first
travis_time:start:035731e8
travis_time:end:035731e8:start=1718879108425206698,finish=1718879108429485041,duration=4278343,event=home_paths
travis_time:start:0673beec
travis_time:end:0673beec:start=1718879108434301888,finish=1718879108447286752,duration=12984864,event=disable_initramfs
travis_time:start:0326bc21
travis_time:end:0326bc21:start=1718879108455304901,finish=1718879108680523231,duration=225218330,event=disable_ssh_roaming
travis_time:start:01ce43b4
travis_time:end:01ce43b4:start=1718879108689070617,finish=1718879108693162098,duration=4091481,event=debug_tools
travis_time:start:0cc0e4a8
travis_time:end:0cc0e4a8:start=1718879108701102086,finish=1718879108707481824,duration=6379738,event=uninstall_oclint
travis_time:start:01573fce
travis_time:end:01573fce:start=1718879108717468161,finish=1718879108720738871,duration=3270710,event=rvm_use
travis_time:start:0034e39c
travis_time:end:0034e39c:start=1718879108728308216,finish=1718879108737627232,duration=9319016,event=rm_etc_boto_cfg
travis_time:start:1ae0e962
travis_time:end:1ae0e962:start=1718879108746179562,finish=1718879108749609594,duration=3430032,event=rm_oraclejdk8_symlink
travis_time:start:130538a0
travis_time:end:130538a0:start=1718879108758924527,finish=1718879108848408703,duration=89484176,event=enable_i386
travis_time:start:0925cad0
travis_time:end:0925cad0:start=1718879108853417521,finish=1718879108857452793,duration=4035272,event=update_rubygems
travis_time:start:129b5d54
travis_time:end:129b5d54:start=1718879108866542991,finish=1718879109682603421,duration=816060430,event=ensure_path_components
travis_time:start:270c3af8
travis_time:end:270c3af8:start=1718879109687845170,finish=1718879109690952518,duration=3107348,event=redefine_curl
travis_time:start:00f42bca
travis_time:end:00f42bca:start=1718879109700750044,finish=1718879109794455837,duration=93705793,event=nonblock_pipe
travis_time:start:00efac01
travis_time:end:00efac01:start=1718879109803915179,finish=1718879124698392979,duration=14894477800,event=apt_get_update
travis_time:start:005075f0
travis_time:end:005075f0:start=1718879124703478314,finish=1718879124706017601,duration=2539287,event=deprecate_xcode_64
travis_time:start:18e49bb6
travis_time:end:18e49bb6:start=1718879124710545331,finish=1718879128370696205,duration=3660150874,event=update_heroku
travis_time:start:08c0e8d2
travis_time:end:08c0e8d2:start=1718879128377024134,finish=1718879128381067512,duration=4043378,event=shell_session_update
travis_time:start:097e23d0
travis_fold:start:docker_mtu_and_registry_mirrors
travis_fold:end:docker_mtu_and_registry_mirrors
travis_time:end:097e23d0:start=1718879128391210984,finish=1718879131904449240,duration=3513238256,event=set_docker_mtu_and_registry_mirrors
travis_time:start:07681f44
travis_fold:start:resolvconf
travis_fold:end:resolvconf
travis_time:end:07681f44:start=1718879131919700468,finish=1718879131987366412,duration=67665944,event=resolvconf
travis_time:start:11a3d086
travis_time:end:11a3d086:start=1718879131996312304,finish=1718879132139404159,duration=143091855,event=maven_central_mirror
travis_time:start:007afb44
travis_time:end:007afb44:start=1718879132145888667,finish=1718879132239977983,duration=94089316,event=maven_https
travis_fold:start:apt
travis_time:start:0e0cc022
$ travis_apt_get_update
travis_time:end:0e0cc022:start=1718879132246212568,finish=1718879139548549222,duration=7302336654,event=prepare
Installing APT Packages
travis_time:start:27f9a3be
$ sudo -E apt-get -yq --no-install-suggests --no-install-recommends $(travis_apt_get_options) install docker-ce
Reading package lists...
Building dependency tree...
Reading state information...
docker-ce is already the newest version (5:20.10.7~3-0~ubuntu-xenial).
0 upgraded, 0 newly installed, 0 to remove and 23 not upgraded.
travis_time:end:27f9a3be:start=1718879139554590702,finish=1718879140306695904,duration=752105202,event=prepare
travis_fold:end:apt

travis_fold:start:snap
Installing 2 Snaps
travis_time:start:012bd465
$ sudo snap install core

Ensure prerequisites for "core" are available                                  /
Download snap "core" (16928) from channel "stable"                             -
Download snap "core" (16928) from channel "stable"                             \
Download snap "core" (16928) from channel "stable"                             |
Download snap "core" (16928) from channel "stable"                             /
Download snap "core" (16928) from channel "stable"                             -
Download snap "core" (16928) from channel "stable"                             \
Download snap "core" (16928) from channel "stable"                             |
Download snap "core" (16928) from channel "stable"                             /
Download snap "core" (16928) from channel "stable"                             -
Download snap "core" (16928) from channel "stable"                             \
Download snap "core" (16928) from channel "stable"                             |[?25l
Download snap "core" (16928) from channel "stable"             0%     0B/s ages!
Download snap "core" (16928) from channel "stable"             0%     0B/s ages!
Download snap "core" (16928) from channel "stable"             0%     0B/s ages!
Download snap "core" (16928) from channel "stable"             0%  542kB/s 3m21s
Download snap "core" (16928) from channel "stable"             0%  875kB/s 2m04s
Download snap "core" (16928) from channel "stable"             1% 1.47MB/s 1m14s
Download snap "core" (16928) from channel "stable"             2% 2.52MB/s 42.5s
Download snap "core" (16928) from channel "stable"             3% 4.43MB/s 23.8s
Download snap "core" (16928) from channel "stable"             6% 6.66MB/s 15.4s
Download snap "core" (16928) from channel "stable"             8% 8.45MB/s 11.9s
Download snap "core" (16928) from channel "stable"            10% 10.1MB/s 9.64s
Download snap "core" (16928) from channel "stable"            13% 11.5MB/s 8.23s
Download snap "core" (16928) from channel "stable"            15% 12.5MB/s 7.37s
Download snap "core" (16928) from channel "stable"            18% 13.4MB/s 6.70s
Download snap "core" (16928) from channel "stable"            20% 14.2MB/s 6.17s
Download snap "core" (16928) from channel "stable"            22% 15.0MB/s 5.65s
Download snap "core" (16928) from channel "stable"            25% 15.7MB/s 5.22s
Download snap "core" (16928) from channel "stable"            27% 15.9MB/s 5.01s
Download snap "core" (16928) from channel "stable"            29% 16.5MB/s 4.67s
Download snap "core" (16928) from channel "stable"            32% 16.9MB/s 4.40s
Download snap "core" (16928) from channel "stable"            34% 17.4MB/s 4.12s
Download snap "core" (16928) from channel "stable"            37% 17.8MB/s 3.87s
Download snap "core" (16928) from channel "stable"            39% 18.1MB/s 3.70s
Download snap "core" (16928) from channel "stable"            41% 18.3MB/s 3.50s
Download snap "core" (16928) from channel "stable"            44% 18.8MB/s 3.26s
Download snap "core" (16928) from channel "stable"            46% 19.0MB/s 3.09s
Download snap "core" (16928) from channel "stable"            49% 19.3MB/s 2.90s
Download snap "core" (16928) from channel "stable"            50% 19.3MB/s 2.79s
Download snap "core" (16928) from channel "stable"            53% 19.6MB/s 2.61s
Download snap "core" (16928) from channel "stable"            55% 19.7MB/s 2.48s
Download snap "core" (16928) from channel "stable"            57% 19.9MB/s 2.34s
Download snap "core" (16928) from channel "stable"            60% 20.0MB/s 2.19s
Download snap "core" (16928) from channel "stable"            62% 20.3MB/s 2.02s
Download snap "core" (16928) from channel "stable"            65% 20.4MB/s 1.88s
Download snap "core" (16928) from channel "stable"            67% 20.6MB/s 1.73s
Download snap "core" (16928) from channel "stable"            70% 20.8MB/s 1.58s
Download snap "core" (16928) from channel "stable"            72% 21.0MB/s 1.44s
Download snap "core" (16928) from channel "stable"            74% 21.0MB/s 1.34s
Download snap "core" (16928) from channel "stable"            76% 21.1MB/s 1.22s
Download snap "core" (16928) from channel "stable"            79% 21.2MB/s 1.09s
Download snap "core" (16928) from channel "stable"            81% 21.3MB/s 957ms
Download snap "core" (16928) from channel "stable"            83% 21.3MB/s 849ms
Download snap "core" (16928) from channel "stable"            86% 21.5MB/s 703ms
Download snap "core" (16928) from channel "stable"            88% 21.6MB/s 584ms
Download snap "core" (16928) from channel "stable"            91% 21.7MB/s 467ms
Download snap "core" (16928) from channel "stable"            93% 21.8MB/s 338ms
Download snap "core" (16928) from channel "stable"            96% 21.9MB/s 222ms
Download snap "core" (16928) from channel "stable"            98% 21.9MB/s 107ms
Download snap "core" (16928) from channel "stable"           100% 21.9MB/s 0.0ns
Download snap "core" (16928) from channel "stable"           100% 21.5MB/s 0.0ns
Download snap "core" (16928) from channel "stable"           100% 21.1MB/s 0.0ns
Download snap "core" (16928) from channel "stable"           100% 20.7MB/s 0.0ns
Fetch and check assertions for snap "core" (16928)                             /
Fetch and check assertions for snap "core" (16928)                             -
Fetch and check assertions for snap "core" (16928)                             \
Fetch and check assertions for snap "core" (16928)                             |
Fetch and check assertions for snap "core" (16928)                             /
Fetch and check assertions for snap "core" (16928)                             -
Fetch and check assertions for snap "core" (16928)                             \
Fetch and check assertions for snap "core" (16928)                             |
Fetch and check assertions for snap "core" (16928)                             /
Fetch and check assertions for snap "core" (16928)                             -
Mount snap "core" (16928)                                                      \
Mount snap "core" (16928)                                                      |
Mount snap "core" (16928)                                                      /
Mount snap "core" (16928)                                                      -
Mount snap "core" (16928)                                                      \
Mount snap "core" (16928)                                                      |
Mount snap "core" (16928)                                                      /
Setup snap "core" (16928) security profiles                                    -
Setup snap "core" (16928) security profiles                                    \
Automatically connect eligible plugs and slots of snap "core"                  |
2024-06-20T10:25:50Z INFO Waiting for automatic snapd restart...

Automatically connect eligible plugs and slots of snap "core"                  /
Run configure hook of "core" snap if present                                   -
[?25hcore 16-2.61.2 from Canonical* installed
travis_time:end:012bd465:start=1718879140320059640,finish=1718879152499690525,duration=12179630885,event=prepare
travis_time:start:250b3747
$ sudo snap install google-cloud-sdk --classic

Ensure prerequisites for "google-cloud-sdk" are available                      /
Ensure prerequisites for "google-cloud-sdk" are available                      -
Ensure prerequisites for "google-cloud-sdk" are available                      \
Ensure prerequisites for "core20" are available                                |
Download snap "core20" (2318) from channel "stable"                            /
Download snap "core20" (2318) from channel "stable"                            -
Download snap "core20" (2318) from channel "stable"                            \
Download snap "core20" (2318) from channel "stable"                            |
Download snap "core20" (2318) from channel "stable"                            /
Download snap "core20" (2318) from channel "stable"                            -
Download snap "core20" (2318) from channel "stable"                            \[?25l
Download snap "core20" (2318) from channel "stable"            0%     0B/s ages!
Download snap "core20" (2318) from channel "stable"            0%     0B/s ages!
Download snap "core20" (2318) from channel "stable"            0%     0B/s ages!
Download snap "core20" (2318) from channel "stable"            0%  360kB/s 3m06s
Download snap "core20" (2318) from channel "stable"            0%  578kB/s 1m56s
Download snap "core20" (2318) from channel "stable"            1%  964kB/s 1m09s
Download snap "core20" (2318) from channel "stable"            2% 1.65MB/s 39.8s
Download snap "core20" (2318) from channel "stable"            4% 2.89MB/s 22.4s
Download snap "core20" (2318) from channel "stable"            7% 4.99MB/s 12.5s
Download snap "core20" (2318) from channel "stable"           11% 6.95MB/s 8.63s
Download snap "core20" (2318) from channel "stable"           14% 8.56MB/s 6.72s
Download snap "core20" (2318) from channel "stable"           18% 10.0MB/s 5.48s
Download snap "core20" (2318) from channel "stable"           22% 11.1MB/s 4.70s
Download snap "core20" (2318) from channel "stable"           26% 12.1MB/s 4.12s
Download snap "core20" (2318) from channel "stable"           30% 13.0MB/s 3.62s
Download snap "core20" (2318) from channel "stable"           34% 13.9MB/s 3.19s
Download snap "core20" (2318) from channel "stable"           37% 14.4MB/s 2.93s
Download snap "core20" (2318) from channel "stable"           41% 15.0MB/s 2.63s
Download snap "core20" (2318) from channel "stable"           45% 15.6MB/s 2.36s
Download snap "core20" (2318) from channel "stable"           49% 16.1MB/s 2.12s
Download snap "core20" (2318) from channel "stable"           52% 16.5MB/s 1.94s
Download snap "core20" (2318) from channel "stable"           56% 16.8MB/s 1.76s
Download snap "core20" (2318) from channel "stable"           60% 17.3MB/s 1.54s
Download snap "core20" (2318) from channel "stable"           64% 17.7MB/s 1.36s
Download snap "core20" (2318) from channel "stable"           68% 18.0MB/s 1.20s
Download snap "core20" (2318) from channel "stable"           72% 18.3MB/s 1.02s
Download snap "core20" (2318) from channel "stable"           76% 18.5MB/s 885ms
Download snap "core20" (2318) from channel "stable"           80% 18.8MB/s 732ms
Download snap "core20" (2318) from channel "stable"           84% 19.0MB/s 575ms
Download snap "core20" (2318) from channel "stable"           87% 19.2MB/s 440ms
Download snap "core20" (2318) from channel "stable"           91% 19.3MB/s 315ms
Download snap "core20" (2318) from channel "stable"           95% 19.5MB/s 185ms
Download snap "core20" (2318) from channel "stable"           99% 19.7MB/s  41ms
Download snap "core20" (2318) from channel "stable"          100% 19.4MB/s 0.0ns
Download snap "core20" (2318) from channel "stable"          100% 18.8MB/s 0.0ns
Fetch and check assertions for snap "core20" (2318)                            |
Fetch and check assertions for snap "core20" (2318)                            /
Fetch and check assertions for snap "core20" (2318)                            -
Fetch and check assertions for snap "core20" (2318)                            \
Mount snap "core20" (2318)                                                     |
Mount snap "core20" (2318)                                                     /
Mount snap "core20" (2318)                                                     -
Mount snap "core20" (2318)                                                     \
Mount snap "core20" (2318)                                                     |
Make snap "core20" (2318) available to the system                              /
Download snap "google-cloud-sdk" (460) from channel "stable"                   -
Download snap "google-cloud-sdk" (460) from channel "stable"                   \
Download snap "google-cloud-sdk" (460) from channel "stable"                   |
Download snap "google-cloud-sdk" (460) from channel "stable"                   /
Download snap "google-cloud-sdk" (460) from channel "stable"                   -
Download snap "google-cloud-sdk" (460) from channel "stable"                   \
Download snap "google-cloud-sdk" (460) from channel "stable"                   |
Download snap "google-cloud-sdk" (460) from channel "stable"                   /[?25l
Download snap "google-cloud-sdk" (460) from channel "stable"   0%     0B/s ages!
Download snap "google-cloud-sdk" (460) from channel "stable"   0%     0B/s ages!
Download snap "google-cloud-sdk" (460) from channel "stable"   0%     0B/s ages!
Download snap "google-cloud-sdk" (460) from channel "stable"   0%     0B/s ages!
Download snap "google-cloud-sdk" (460) from channel "stable"   0%     0B/s ages!
Download snap "google-cloud-sdk" (460) from channel "stable"   0% 1.23MB/s 4m60s
Download snap "google-cloud-sdk" (460) from channel "stable"   1% 3.17MB/s 1m56s
Download snap "google-cloud-sdk" (460) from channel "stable"   1% 5.55MB/s 1m06s
Download snap "google-cloud-sdk" (460) from channel "stable"   2% 7.40MB/s 49.1s
Download snap "google-cloud-sdk" (460) from channel "stable"   2% 8.88MB/s 40.7s
Download snap "google-cloud-sdk" (460) from channel "stable"   3% 10.8MB/s 33.3s
Download snap "google-cloud-sdk" (460) from channel "stable"   4% 11.7MB/s 30.4s
Download snap "google-cloud-sdk" (460) from channel "stable"   4% 12.5MB/s 28.3s
Download snap "google-cloud-sdk" (460) from channel "stable"   5% 13.7MB/s 25.5s
Download snap "google-cloud-sdk" (460) from channel "stable"   6% 14.3MB/s 24.4s
Download snap "google-cloud-sdk" (460) from channel "stable"   7% 15.3MB/s 22.6s
Download snap "google-cloud-sdk" (460) from channel "stable"   7% 15.7MB/s 21.9s
Download snap "google-cloud-sdk" (460) from channel "stable"   8% 16.0MB/s 21.3s
Download snap "google-cloud-sdk" (460) from channel "stable"   9% 16.7MB/s 20.2s
Download snap "google-cloud-sdk" (460) from channel "stable"   9% 17.0MB/s 19.7s
Download snap "google-cloud-sdk" (460) from channel "stable"  10% 17.6MB/s 18.9s
Download snap "google-cloud-sdk" (460) from channel "stable"  11% 17.8MB/s 18.5s
Download snap "google-cloud-sdk" (460) from channel "stable"  11% 18.0MB/s 18.2s
Download snap "google-cloud-sdk" (460) from channel "stable"  12% 18.5MB/s 17.6s
Download snap "google-cloud-sdk" (460) from channel "stable"  13% 18.7MB/s 17.3s
Download snap "google-cloud-sdk" (460) from channel "stable"  14% 19.1MB/s 16.8s
Download snap "google-cloud-sdk" (460) from channel "stable"  14% 19.2MB/s 16.6s
Download snap "google-cloud-sdk" (460) from channel "stable"  15% 19.6MB/s 16.1s
Download snap "google-cloud-sdk" (460) from channel "stable"  16% 19.7MB/s 15.9s
Download snap "google-cloud-sdk" (460) from channel "stable"  16% 19.7MB/s 15.7s
Download snap "google-cloud-sdk" (460) from channel "stable"  17% 19.8MB/s 15.5s
Download snap "google-cloud-sdk" (460) from channel "stable"  18% 20.1MB/s 15.2s
Download snap "google-cloud-sdk" (460) from channel "stable"  18% 20.2MB/s 15.0s
Download snap "google-cloud-sdk" (460) from channel "stable"  19% 20.2MB/s 14.8s
Download snap "google-cloud-sdk" (460) from channel "stable"  20% 20.5MB/s 14.5s
Download snap "google-cloud-sdk" (460) from channel "stable"  20% 20.8MB/s 14.2s
Download snap "google-cloud-sdk" (460) from channel "stable"  21% 21.0MB/s 13.9s
Download snap "google-cloud-sdk" (460) from channel "stable"  22% 21.0MB/s 13.8s
Download snap "google-cloud-sdk" (460) from channel "stable"  23% 21.3MB/s 13.5s
Download snap "google-cloud-sdk" (460) from channel "stable"  23% 21.3MB/s 13.3s
Download snap "google-cloud-sdk" (460) from channel "stable"  24% 21.3MB/s 13.2s
Download snap "google-cloud-sdk" (460) from channel "stable"  25% 21.3MB/s 13.1s
Download snap "google-cloud-sdk" (460) from channel "stable"  25% 21.5MB/s 12.9s
Download snap "google-cloud-sdk" (460) from channel "stable"  26% 21.5MB/s 12.7s
Download snap "google-cloud-sdk" (460) from channel "stable"  26% 21.4MB/s 12.8s
Download snap "google-cloud-sdk" (460) from channel "stable"  27% 21.6MB/s 12.5s
Download snap "google-cloud-sdk" (460) from channel "stable"  28% 21.7MB/s 12.3s
Download snap "google-cloud-sdk" (460) from channel "stable"  29% 21.7MB/s 12.2s
Download snap "google-cloud-sdk" (460) from channel "stable"  29% 21.9MB/s 11.9s
Download snap "google-cloud-sdk" (460) from channel "stable"  30% 22.0MB/s 11.7s
Download snap "google-cloud-sdk" (460) from channel "stable"  31% 22.1MB/s 11.6s
Download snap "google-cloud-sdk" (460) from channel "stable"  31% 22.1MB/s 11.5s
Download snap "google-cloud-sdk" (460) from channel "stable"  32% 22.2MB/s 11.3s
Download snap "google-cloud-sdk" (460) from channel "stable"  33% 22.2MB/s 11.2s
Download snap "google-cloud-sdk" (460) from channel "stable"  33% 22.1MB/s 11.2s
Download snap "google-cloud-sdk" (460) from channel "stable"  34% 21.9MB/s 11.2s
Download snap "google-cloud-sdk" (460) from channel "stable"  34% 22.1MB/s 11.0s
Download snap "google-cloud-sdk" (460) from channel "stable"  35% 22.1MB/s 10.9s
Download snap "google-cloud-sdk" (460) from channel "stable"  36% 22.2MB/s 10.7s
Download snap "google-cloud-sdk" (460) from channel "stable"  37% 22.3MB/s 10.5s
Download snap "google-cloud-sdk" (460) from channel "stable"  37% 22.3MB/s 10.4s
Download snap "google-cloud-sdk" (460) from channel "stable"  38% 22.3MB/s 10.3s
Download snap "google-cloud-sdk" (460) from channel "stable"  39% 22.3MB/s 10.2s
Download snap "google-cloud-sdk" (460) from channel "stable"  39% 22.3MB/s 10.1s
Download snap "google-cloud-sdk" (460) from channel "stable"  40% 22.4MB/s 9.92s
Download snap "google-cloud-sdk" (460) from channel "stable"  41% 22.5MB/s 9.74s
Download snap "google-cloud-sdk" (460) from channel "stable"  41% 22.5MB/s 9.64s
Download snap "google-cloud-sdk" (460) from channel "stable"  42% 22.5MB/s 9.54s
Download snap "google-cloud-sdk" (460) from channel "stable"  43% 22.6MB/s 9.37s
Download snap "google-cloud-sdk" (460) from channel "stable"  44% 22.7MB/s 9.19s
Download snap "google-cloud-sdk" (460) from channel "stable"  44% 22.7MB/s 9.10s
Download snap "google-cloud-sdk" (460) from channel "stable"  45% 22.7MB/s 9.00s
Download snap "google-cloud-sdk" (460) from channel "stable"  45% 22.7MB/s 8.90s
Download snap "google-cloud-sdk" (460) from channel "stable"  46% 22.7MB/s 8.81s
Download snap "google-cloud-sdk" (460) from channel "stable"  47% 22.8MB/s 8.64s
Download snap "google-cloud-sdk" (460) from channel "stable"  48% 22.9MB/s 8.47s
Download snap "google-cloud-sdk" (460) from channel "stable"  48% 22.9MB/s 8.38s
Download snap "google-cloud-sdk" (460) from channel "stable"  49% 22.9MB/s 8.28s
Download snap "google-cloud-sdk" (460) from channel "stable"  49% 22.7MB/s 8.32s
Download snap "google-cloud-sdk" (460) from channel "stable"  49% 22.5MB/s 8.36s
Download snap "google-cloud-sdk" (460) from channel "stable"  49% 22.3MB/s 8.39s
Download snap "google-cloud-sdk" (460) from channel "stable"  50% 22.3MB/s 8.29s
Download snap "google-cloud-sdk" (460) from channel "stable"  51% 22.3MB/s 8.19s
Download snap "google-cloud-sdk" (460) from channel "stable"  51% 22.4MB/s 8.03s
Download snap "google-cloud-sdk" (460) from channel "stable"  52% 22.2MB/s 8.06s
Download snap "google-cloud-sdk" (460) from channel "stable"  52% 22.1MB/s 8.02s
Download snap "google-cloud-sdk" (460) from channel "stable"  52% 21.9MB/s 8.05s
Download snap "google-cloud-sdk" (460) from channel "stable"  53% 22.0MB/s 7.88s
Download snap "google-cloud-sdk" (460) from channel "stable"  54% 22.0MB/s 7.78s
Download snap "google-cloud-sdk" (460) from channel "stable"  54% 22.0MB/s 7.67s
Download snap "google-cloud-sdk" (460) from channel "stable"  55% 22.1MB/s 7.51s
Download snap "google-cloud-sdk" (460) from channel "stable"  56% 22.1MB/s 7.41s
Download snap "google-cloud-sdk" (460) from channel "stable"  56% 22.0MB/s 7.43s
Download snap "google-cloud-sdk" (460) from channel "stable"  56% 21.8MB/s 7.44s
Download snap "google-cloud-sdk" (460) from channel "stable"  57% 21.8MB/s 7.34s
Download snap "google-cloud-sdk" (460) from channel "stable"  57% 21.8MB/s 7.24s
Download snap "google-cloud-sdk" (460) from channel "stable"  58% 21.9MB/s 7.07s
Download snap "google-cloud-sdk" (460) from channel "stable"  59% 21.9MB/s 6.97s
Download snap "google-cloud-sdk" (460) from channel "stable"  60% 22.0MB/s 6.81s
Download snap "google-cloud-sdk" (460) from channel "stable"  60% 21.9MB/s 6.76s
Download snap "google-cloud-sdk" (460) from channel "stable"  60% 21.8MB/s 6.71s
Download snap "google-cloud-sdk" (460) from channel "stable"  61% 21.8MB/s 6.61s
Download snap "google-cloud-sdk" (460) from channel "stable"  62% 21.9MB/s 6.45s
Download snap "google-cloud-sdk" (460) from channel "stable"  62% 21.9MB/s 6.35s
Download snap "google-cloud-sdk" (460) from channel "stable"  63% 21.9MB/s 6.30s
Download snap "google-cloud-sdk" (460) from channel "stable"  63% 21.9MB/s 6.19s
Download snap "google-cloud-sdk" (460) from channel "stable"  64% 21.9MB/s 6.03s
Download snap "google-cloud-sdk" (460) from channel "stable"  65% 22.0MB/s 5.88s
Download snap "google-cloud-sdk" (460) from channel "stable"  66% 22.0MB/s 5.78s
Download snap "google-cloud-sdk" (460) from channel "stable"  66% 21.9MB/s 5.72s
Download snap "google-cloud-sdk" (460) from channel "stable"  66% 21.9MB/s 5.67s
Download snap "google-cloud-sdk" (460) from channel "stable"  67% 21.9MB/s 5.52s
Download snap "google-cloud-sdk" (460) from channel "stable"  68% 21.9MB/s 5.41s
Download snap "google-cloud-sdk" (460) from channel "stable"  69% 22.0MB/s 5.26s
Download snap "google-cloud-sdk" (460) from channel "stable"  70% 22.1MB/s 5.11s
Download snap "google-cloud-sdk" (460) from channel "stable"  70% 22.0MB/s 5.10s
Download snap "google-cloud-sdk" (460) from channel "stable"  70% 21.8MB/s 5.15s
Download snap "google-cloud-sdk" (460) from channel "stable"  70% 21.6MB/s 5.19s
Download snap "google-cloud-sdk" (460) from channel "stable"  70% 21.4MB/s 5.24s
Download snap "google-cloud-sdk" (460) from channel "stable"  70% 21.3MB/s 5.23s
Download snap "google-cloud-sdk" (460) from channel "stable"  70% 21.2MB/s 5.22s
Download snap "google-cloud-sdk" (460) from channel "stable"  70% 21.0MB/s 5.27s
Download snap "google-cloud-sdk" (460) from channel "stable"  70% 20.9MB/s 5.26s
Download snap "google-cloud-sdk" (460) from channel "stable"  71% 20.8MB/s 5.25s
Download snap "google-cloud-sdk" (460) from channel "stable"  71% 20.7MB/s 5.19s
Download snap "google-cloud-sdk" (460) from channel "stable"  71% 20.6MB/s 5.18s
Download snap "google-cloud-sdk" (460) from channel "stable"  72% 20.6MB/s 5.12s
Download snap "google-cloud-sdk" (460) from channel "stable"  72% 20.6MB/s 5.00s
Download snap "google-cloud-sdk" (460) from channel "stable"  73% 20.5MB/s 4.94s
Download snap "google-cloud-sdk" (460) from channel "stable"  73% 20.6MB/s 4.83s
Download snap "google-cloud-sdk" (460) from channel "stable"  74% 20.6MB/s 4.72s
Download snap "google-cloud-sdk" (460) from channel "stable"  74% 20.5MB/s 4.70s
Download snap "google-cloud-sdk" (460) from channel "stable"  74% 20.4MB/s 4.64s
Download snap "google-cloud-sdk" (460) from channel "stable"  75% 20.4MB/s 4.53s
Download snap "google-cloud-sdk" (460) from channel "stable"  76% 20.5MB/s 4.41s
Download snap "google-cloud-sdk" (460) from channel "stable"  76% 20.5MB/s 4.30s
Download snap "google-cloud-sdk" (460) from channel "stable"  77% 20.5MB/s 4.14s
Download snap "google-cloud-sdk" (460) from channel "stable"  78% 20.6MB/s 3.98s
Download snap "google-cloud-sdk" (460) from channel "stable"  79% 20.7MB/s 3.82s
Download snap "google-cloud-sdk" (460) from channel "stable"  79% 20.7MB/s 3.71s
Download snap "google-cloud-sdk" (460) from channel "stable"  79% 20.5MB/s 3.74s
Download snap "google-cloud-sdk" (460) from channel "stable"  80% 20.5MB/s 3.67s
Download snap "google-cloud-sdk" (460) from channel "stable"  80% 20.4MB/s 3.61s
Download snap "google-cloud-sdk" (460) from channel "stable"  80% 20.4MB/s 3.54s
Download snap "google-cloud-sdk" (460) from channel "stable"  81% 20.4MB/s 3.43s
Download snap "google-cloud-sdk" (460) from channel "stable"  82% 20.5MB/s 3.27s
Download snap "google-cloud-sdk" (460) from channel "stable"  83% 20.5MB/s 3.16s
Download snap "google-cloud-sdk" (460) from channel "stable"  83% 20.6MB/s 3.00s
Download snap "google-cloud-sdk" (460) from channel "stable"  84% 20.6MB/s 2.89s
Download snap "google-cloud-sdk" (460) from channel "stable"  85% 20.6MB/s 2.78s
Download snap "google-cloud-sdk" (460) from channel "stable"  85% 20.5MB/s 2.76s
Download snap "google-cloud-sdk" (460) from channel "stable"  85% 20.4MB/s 2.73s
Download snap "google-cloud-sdk" (460) from channel "stable"  85% 20.4MB/s 2.66s
Download snap "google-cloud-sdk" (460) from channel "stable"  86% 20.3MB/s 2.59s
Download snap "google-cloud-sdk" (460) from channel "stable"  86% 20.3MB/s 2.48s
Download snap "google-cloud-sdk" (460) from channel "stable"  87% 20.4MB/s 2.33s
Download snap "google-cloud-sdk" (460) from channel "stable"  88% 20.4MB/s 2.26s
Download snap "google-cloud-sdk" (460) from channel "stable"  88% 20.4MB/s 2.15s
Download snap "google-cloud-sdk" (460) from channel "stable"  89% 20.4MB/s 1.99s
Download snap "google-cloud-sdk" (460) from channel "stable"  90% 20.5MB/s 1.84s
Download snap "google-cloud-sdk" (460) from channel "stable"  90% 20.5MB/s 1.73s
Download snap "google-cloud-sdk" (460) from channel "stable"  91% 20.5MB/s 1.62s
Download snap "google-cloud-sdk" (460) from channel "stable"  92% 20.5MB/s 1.51s
Download snap "google-cloud-sdk" (460) from channel "stable"  92% 20.5MB/s 1.40s
Download snap "google-cloud-sdk" (460) from channel "stable"  93% 20.6MB/s 1.25s
Download snap "google-cloud-sdk" (460) from channel "stable"  94% 20.6MB/s 1.14s
Download snap "google-cloud-sdk" (460) from channel "stable"  94% 20.7MB/s 991ms
Download snap "google-cloud-sdk" (460) from channel "stable"  95% 20.7MB/s 881ms
Download snap "google-cloud-sdk" (460) from channel "stable"  96% 20.7MB/s 772ms
Download snap "google-cloud-sdk" (460) from channel "stable"  96% 20.7MB/s 663ms
Download snap "google-cloud-sdk" (460) from channel "stable"  97% 20.7MB/s 516ms
Download snap "google-cloud-sdk" (460) from channel "stable"  98% 20.8MB/s 371ms
Download snap "google-cloud-sdk" (460) from channel "stable"  99% 20.8MB/s 262ms
Download snap "google-cloud-sdk" (460) from channel "stable"  99% 20.8MB/s 154ms
Download snap "google-cloud-sdk" (460) from channel "stable" 100% 20.8MB/s  46ms
Download snap "google-cloud-sdk" (460) from channel "stable" 100% 20.8MB/s 0.0ns
Download snap "google-cloud-sdk" (460) from channel "stable" 100% 20.6MB/s 0.0ns
Download snap "google-cloud-sdk" (460) from channel "stable" 100% 20.5MB/s 0.0ns
Download snap "google-cloud-sdk" (460) from channel "stable" 100% 20.4MB/s 0.0ns
Download snap "google-cloud-sdk" (460) from channel "stable" 100% 20.3MB/s 0.0ns
Download snap "google-cloud-sdk" (460) from channel "stable" 100% 20.2MB/s 0.0ns
Download snap "google-cloud-sdk" (460) from channel "stable" 100% 20.1MB/s 0.0ns
Download snap "google-cloud-sdk" (460) from channel "stable" 100% 20.0MB/s 0.0ns
Download snap "google-cloud-sdk" (460) from channel "stable" 100% 19.8MB/s 0.0ns
Download snap "google-cloud-sdk" (460) from channel "stable" 100% 19.7MB/s 0.0ns
Download snap "google-cloud-sdk" (460) from channel "stable" 100% 19.6MB/s 0.0ns
Download snap "google-cloud-sdk" (460) from channel "stable" 100% 19.5MB/s 0.0ns
Download snap "google-cloud-sdk" (460) from channel "stable" 100% 19.4MB/s 0.0ns
Fetch and check assertions for snap "google-cloud-sdk" (460)                   -
Fetch and check assertions for snap "google-cloud-sdk" (460)                   \
Fetch and check assertions for snap "google-cloud-sdk" (460)                   |
Fetch and check assertions for snap "google-cloud-sdk" (460)                   /
Fetch and check assertions for snap "google-cloud-sdk" (460)                   -
Fetch and check assertions for snap "google-cloud-sdk" (460)                   \
Fetch and check assertions for snap "google-cloud-sdk" (460)                   |
Mount snap "google-cloud-sdk" (460)                                            /
Mount snap "google-cloud-sdk" (460)                                            -
Mount snap "google-cloud-sdk" (460)                                            \
Mount snap "google-cloud-sdk" (460)                                            |
Mount snap "google-cloud-sdk" (460)                                            /
Mount snap "google-cloud-sdk" (460)                                            -
Mount snap "google-cloud-sdk" (460)                                            \
Mount snap "google-cloud-sdk" (460)                                            |
Mount snap "google-cloud-sdk" (460)                                            /
Mount snap "google-cloud-sdk" (460)                                            -
Mount snap "google-cloud-sdk" (460)                                            \
Mount snap "google-cloud-sdk" (460)                                            |
Mount snap "google-cloud-sdk" (460)                                            /
Mount snap "google-cloud-sdk" (460)                                            -
Mount snap "google-cloud-sdk" (460)                                            \
Mount snap "google-cloud-sdk" (460)                                            |
Mount snap "google-cloud-sdk" (460)                                            /
Mount snap "google-cloud-sdk" (460)                                            -
Mount snap "google-cloud-sdk" (460)                                            \
Mount snap "google-cloud-sdk" (460)                                            |
Mount snap "google-cloud-sdk" (460)                                            /
Copy snap "google-cloud-sdk" data                                              -
Set automatic aliases for snap "google-cloud-sdk"                              \
[?25hgoogle-cloud-sdk 481.0.0 from Cloud SDK (google-cloud-sdk**) installed
travis_time:end:250b3747:start=1718879152506324104,finish=1718879184760618364,duration=32254294260,event=prepare
travis_time:start:2c880669
$ sudo snap install vault

Ensure prerequisites for "vault" are available                                 /
Ensure prerequisites for "vault" are available                                 -
Ensure prerequisites for "vault" are available                                 \
Download snap "core22" (1380) from channel "stable"                            |
Download snap "core22" (1380) from channel "stable"                            /
Download snap "core22" (1380) from channel "stable"                            -
Download snap "core22" (1380) from channel "stable"                            \
Download snap "core22" (1380) from channel "stable"                            |
Download snap "core22" (1380) from channel "stable"                            /[?25l
Download snap "core22" (1380) from channel "stable"            0% 1.59MB/s 48.7s
Download snap "core22" (1380) from channel "stable"            4% 14.5MB/s 5.16s
Download snap "core22" (1380) from channel "stable"           15% 38.7MB/s 1.71s
Download snap "core22" (1380) from channel "stable"           27% 51.1MB/s 1.12s
Download snap "core22" (1380) from channel "stable"           38% 58.6MB/s 822ms
Download snap "core22" (1380) from channel "stable"           49% 63.3MB/s 621ms
Download snap "core22" (1380) from channel "stable"           62% 67.4MB/s 443ms
Download snap "core22" (1380) from channel "stable"           74% 70.0MB/s 294ms
Download snap "core22" (1380) from channel "stable"           85% 71.8MB/s 164ms
Download snap "core22" (1380) from channel "stable"           97% 73.6MB/s  33ms
Download snap "core22" (1380) from channel "stable"          100% 69.2MB/s 0.0ns
Download snap "core22" (1380) from channel "stable"          100% 63.5MB/s 0.0ns
Fetch and check assertions for snap "core22" (1380)                            -
Fetch and check assertions for snap "core22" (1380)                            \
Fetch and check assertions for snap "core22" (1380)                            |
Fetch and check assertions for snap "core22" (1380)                            /
Mount snap "core22" (1380)                                                     -
Mount snap "core22" (1380)                                                     \
Mount snap "core22" (1380)                                                     |
Mount snap "core22" (1380)                                                     /
Mount snap "core22" (1380)                                                     -
Mount snap "core22" (1380)                                                     \
Set automatic aliases for snap "core22"                                        |
Download snap "vault" (2275) from channel "1.16/stable"                        /
Download snap "vault" (2275) from channel "1.16/stable"                        -
Download snap "vault" (2275) from channel "1.16/stable"                        \
Download snap "vault" (2275) from channel "1.16/stable"                        |
Download snap "vault" (2275) from channel "1.16/stable"                        /
Download snap "vault" (2275) from channel "1.16/stable"                        -[?25l
Download snap "vault" (2275) from channel "1.16/stable"        0% 8.05MB/s 24.2s
Download snap "vault" (2275) from channel "1.16/stable"        3% 30.2MB/s 6.29s
Download snap "vault" (2275) from channel "1.16/stable"        8% 50.9MB/s 3.54s
Download snap "vault" (2275) from channel "1.16/stable"       12% 59.4MB/s 2.90s
Download snap "vault" (2275) from channel "1.16/stable"       17% 65.2MB/s 2.50s
Download snap "vault" (2275) from channel "1.16/stable"       21% 68.5MB/s 2.25s
Download snap "vault" (2275) from channel "1.16/stable"       26% 71.9MB/s 2.02s
Download snap "vault" (2275) from channel "1.16/stable"       30% 73.0MB/s 1.87s
Download snap "vault" (2275) from channel "1.16/stable"       35% 74.7MB/s 1.71s
Download snap "vault" (2275) from channel "1.16/stable"       40% 76.2MB/s 1.55s
Download snap "vault" (2275) from channel "1.16/stable"       44% 77.0MB/s 1.42s
Download snap "vault" (2275) from channel "1.16/stable"       49% 78.2MB/s 1.27s
Download snap "vault" (2275) from channel "1.16/stable"       53% 78.4MB/s 1.17s
Download snap "vault" (2275) from channel "1.16/stable"       58% 79.2MB/s 1.04s
Download snap "vault" (2275) from channel "1.16/stable"       62% 79.2MB/s 939ms
Download snap "vault" (2275) from channel "1.16/stable"       67% 79.8MB/s 819ms
Download snap "vault" (2275) from channel "1.16/stable"       72% 80.5MB/s 691ms
Download snap "vault" (2275) from channel "1.16/stable"       76% 81.0MB/s 571ms
Download snap "vault" (2275) from channel "1.16/stable"       81% 80.9MB/s 470ms
Download snap "vault" (2275) from channel "1.16/stable"       86% 81.5MB/s 347ms
Download snap "vault" (2275) from channel "1.16/stable"       90% 81.8MB/s 231ms
Download snap "vault" (2275) from channel "1.16/stable"       95% 81.8MB/s 126ms
Download snap "vault" (2275) from channel "1.16/stable"       99% 82.0MB/s  16ms
Download snap "vault" (2275) from channel "1.16/stable"      100% 79.2MB/s 0.0ns
Download snap "vault" (2275) from channel "1.16/stable"      100% 76.0MB/s 0.0ns
Download snap "vault" (2275) from channel "1.16/stable"      100% 73.2MB/s 0.0ns
Download snap "vault" (2275) from channel "1.16/stable"      100% 70.5MB/s 0.0ns
Download snap "vault" (2275) from channel "1.16/stable"      100% 68.0MB/s 0.0ns
Download snap "vault" (2275) from channel "1.16/stable"      100% 65.7MB/s 0.0ns
Download snap "vault" (2275) from channel "1.16/stable"      100% 63.6MB/s 0.0ns
Fetch and check assertions for snap "vault" (2275)                             \
Fetch and check assertions for snap "vault" (2275)                             |
Fetch and check assertions for snap "vault" (2275)                             /
Fetch and check assertions for snap "vault" (2275)                             -
Fetch and check assertions for snap "vault" (2275)                             \
Fetch and check assertions for snap "vault" (2275)                             |
Fetch and check assertions for snap "vault" (2275)                             /
Mount snap "vault" (2275)                                                      -
Mount snap "vault" (2275)                                                      \
Setup snap "vault" (2275) security profiles                                    |
Setup snap "vault" (2275) security profiles for auto-connections               /
Run install hook of "vault" snap if present                                    -
Run install hook of "vault" snap if present                                    \
Run install hook of "vault" snap if present                                    |
Run install hook of "vault" snap if present                                    /
Run install hook of "vault" snap if present                                    -
[?25hvault (1.16/stable) 1.16.2 from Canonical** installed
travis_time:end:2c880669:start=1718879184768383438,finish=1718879195311418946,duration=10543035508,event=prepare
travis_time:start:02053aeb
$ sudo snap list
Name              Version    Rev    Tracking       Publisher           Notes
core              16-2.61.2  16928  latest/stable  canonical**         core
core20            20240416   2318   latest/stable  canonical**         base
core22            20240408   1380   latest/stable  canonical**         base
google-cloud-sdk  481.0.0    460    latest/stable  google-cloud-sdk**  classic
vault             1.16.2     2275   1.16/stable    canonical**         -
travis_time:end:02053aeb:start=1718879195317612925,finish=1718879195363295521,duration=45682596,event=prepare
travis_fold:end:snap

travis_time:start:20913449
travis_fold:start:services
travis_time:start:0378f623
$ sudo systemctl start rabbitmq-server
Failed to start rabbitmq-server.service: Unit rabbitmq-server.service not found.
travis_time:end:0378f623:start=1718879195372808653,finish=1718879195389042267,duration=16233614,event=prepare
travis_time:start:1dd822ae
$ sudo systemctl start docker
travis_time:end:1dd822ae:start=1718879195395738913,finish=1718879195408475842,duration=12736929,event=prepare
travis_time:start:0d8475fe
$ sudo systemctl start redis-server
travis_time:end:0d8475fe:start=1718879195417540410,finish=1718879195502913521,duration=85373111,event=prepare
travis_fold:end:services
travis_time:end:0d8475fe:start=1718879195417540410,finish=1718879198507779501,duration=3090239091,event=services
travis_time:start:1258b1c5
travis_time:end:1258b1c5:start=1718879198515674436,finish=1718879198518896326,duration=3221890,event=fix_ps4
Updating gimme
travis_time:start:0d9cb296

travis_fold:start:git.checkout
travis_time:start:046823b1
travis_time:end:046823b1:start=1718879204097014660,finish=1718879204104055067,duration=7040407,event=checkout
travis_time:start:132c7e42
$ git clone --depth=10 --branch=kw-updated_worker https://github.com/travis-ci/worker.git travis-ci/worker
Cloning into 'travis-ci/worker'...
travis_time:end:132c7e42:start=1718879204113887951,finish=1718879204734068681,duration=620180730,event=checkout
$ cd travis-ci/worker
$ git checkout -qf 58697282d2946364f2bbed5722fd313b6f5deea2
travis_fold:end:git.checkout

travis_time:end:132c7e42:start=1718879204113887951,finish=1718879204753313525,duration=639425574,event=checkout
$ travis_export_go 1.18.x github.com/travis-ci/worker
travis_time:start:2b93436d

Setting environment variables from repository settings
$ export ARTIFACTS_PATHS=./build
$ export ARTIFACTS_BUCKET=travis-worker-artifacts
$ export ARTIFACTS_PERMISSIONS=public-read
$ export ARTIFACTS_KEY=[secure]
$ export ARTIFACTS_SECRET=[secure]
$ export PACKAGECLOUD_TOKEN=[secure]
$ export DOCKER_HUB_TRIGGER_URL=[secure]
$ export DOCKER_LOGIN_USERNAME=[secure]
$ export DOCKER_LOGIN_PASSWORD=[secure]
$ export VAULT_PASS=[secure]
$ export GCE_PROJECT=[secure]
$ export VAULT_USERNAME=[secure]
$ export VAULT_ADDR=[secure]
$ export CLOUDSDK_CORE_DISABLE_PROMPTS=[secure]

Setting environment variables from .travis.yml
$ export AMQP_URI="amqp://"
$ export GOPATH="$HOME/gopath"
$ export PATH="bin:$HOME/gopath/bin:$HOME/bin:$PATH"
$ export CHECKOUT_ROOT="$HOME/gopath/src/github.com/travis-ci/worker"
$ export GO15VENDOREXPERIMENT='1'
$ export REDIS_URL="redis://"

travis_time:end:2b93436d:start=1718879204765668924,finish=1718879204799481615,duration=33812691,event=env
travis_time:start:217db028
$ travis_setup_go
go version go1.18.10 linux/amd64
$ export GOPATH="/home/travis/gopath"
$ export PATH="/home/travis/gopath/bin:/home/travis/.gimme/versions/go1.18.10.linux.amd64/bin:bin:/home/travis/gopath/bin:/home/travis/bin:/home/travis/bin:/home/travis/bin:/home/travis/.local/bin:/usr/local/lib/jvm/openjdk11/bin:/opt/pyenv/shims:/home/travis/.phpenv/shims:/home/travis/perl5/perlbrew/bin:/home/travis/perl5/perlbrew/perls/5.34.1/bin:/home/travis/.nvm/versions/node/v16.16.0/bin:/home/travis/.rvm/gems/ruby-2.7.6/bin:/home/travis/.rvm/gems/ruby-2.7.6@global/bin:/home/travis/.rvm/rubies/ruby-2.7.6/bin:/home/travis/gopath/bin:/home/travis/.gimme/versions/go1.18.4.linux.amd64/bin:/usr/local/maven-3.8.8/bin:/usr/local/cmake-3.26.3/bin:/usr/local/clang-7.0.0/bin:/usr/local/sbin:/usr/local/bin:/usr/sbin:/usr/bin:/sbin:/bin:/snap/bin:/home/travis/.rvm/bin:/home/travis/.phpenv/bin:/opt/pyenv/bin:/home/travis/.yarn/bin"
$ export GO111MODULE="auto"
travis_time:end:217db028:start=1718879204821209119,finish=1718879209340873182,duration=4519664063,event=
travis_fold:start:cache.1
Setting up build cache
$ export CASHER_DIR=${TRAVIS_HOME}/.casher
travis_time:start:1b0afa70
$ Installing caching utilities
travis_time:end:1b0afa70:start=1718879210148309309,finish=1718879210413081859,duration=264772550,event=setup_casher
travis_time:start:097e0b9a
travis_time:end:097e0b9a:start=1718879210421908043,finish=1718879210425710657,duration=3802614,event=setup_casher
travis_time:start:2884f31d
attempting to download cache archive
fetching kw-updated_worker/cache--linux-xenial-8e66efc74188d5464db6c5a9d3decd4835ed340208a6ac39f04af14f2f93a35a--go-1.18.x.tgz
found cache
travis_time:end:2884f31d:start=1718879210430524305,finish=1718879213148088646,duration=2717564341,event=setup_casher
travis_time:start:0109f848
travis_time:end:0109f848:start=1718879213152871268,finish=1718879213156726268,duration=3855000,event=setup_casher
travis_time:start:013e68af
adding /home/travis/gopath/src/github.com/travis-ci/worker/vendor to cache
creating directory /home/travis/gopath/src/github.com/travis-ci/worker/vendor
adding /home/travis/.cache/go-build to cache
adding /home/travis/gopath/bin to cache
adding /home/travis/gopath/pkg/mod to cache
creating directory /home/travis/gopath/pkg/mod
travis_time:end:013e68af:start=1718879213162304571,finish=1718879226730598304,duration=13568293733,event=setup_casher
travis_fold:end:cache.1

$ gimme version
v1.5.4
$ go version
go version go1.18.10 linux/amd64
travis_fold:start:go.env
$ go env
GO111MODULE="auto"
GOARCH="amd64"
GOBIN=""
GOCACHE="/home/travis/.cache/go-build"
GOENV="/home/travis/.config/go/env"
GOEXE=""
GOEXPERIMENT=""
GOFLAGS=""
GOHOSTARCH="amd64"
GOHOSTOS="linux"
GOINSECURE=""
GOMODCACHE="/home/travis/gopath/pkg/mod"
GONOPROXY=""
GONOSUMDB=""
GOOS="linux"
GOPATH="/home/travis/gopath"
GOPRIVATE=""
GOPROXY="https://proxy.golang.org,direct"
GOROOT="/home/travis/.gimme/versions/go1.18.10.linux.amd64"
GOSUMDB="sum.golang.org"
GOTMPDIR=""
GOTOOLDIR="/home/travis/.gimme/versions/go1.18.10.linux.amd64/pkg/tool/linux_amd64"
GOVCS=""
GOVERSION="go1.18.10"
GCCGO="gccgo"
GOAMD64="v1"
AR="ar"
CC="gcc"
CXX="g++"
CGO_ENABLED="1"
GOMOD="/home/travis/gopath/src/github.com/travis-ci/worker/go.mod"
GOWORK=""
CGO_CFLAGS="-g -O2"
CGO_CPPFLAGS=""
CGO_CXXFLAGS="-g -O2"
CGO_FFLAGS="-g -O2"
CGO_LDFLAGS="-g -O2"
PKG_CONFIG="pkg-config"
GOGCCFLAGS="-fPIC -m64 -pthread -fmessage-length=0 -fdebug-prefix-map=/tmp/go-build2159022756=/tmp/go-build -gno-record-gcc-switches"
travis_fold:end:go.env
travis_fold:start:install
travis_time:start:3235a4fc
$ travis_install_go_dependencies 1.18.x -v
Makefile detected
travis_time:end:3235a4fc:start=1718879226922234833,finish=1718879226927499982,duration=5265149,event=install
travis_fold:end:install
travis_time:start:30ddfb14
$ vault login --no-print -method=userpass username=$VAULT_USERNAME password=$VAULT_PASS
travis_time:end:30ddfb14:start=1718879226936788958,finish=1718879230825724606,duration=3888935648,event=script
The command "vault login --no-print -method=userpass username=$VAULT_USERNAME password=$VAULT_PASS" exited with 0.
travis_time:start:1fc053a2
$ vault kv get -field=secret gcp/[secure]-sa-key > /tmp/[secure]_key.json;
travis_time:end:1fc053a2:start=1718879230840201377,finish=1718879231149606722,duration=309405345,event=script
The command "vault kv get -field=secret gcp/[secure]-sa-key > /tmp/[secure]_key.json;" exited with 0.
travis_time:start:094e58e8
$ gcloud -q auth activate-service-account --key-file /tmp/[secure]_key.json;
Activated service account credentials for: [sa-docker-images@[secure].iam.gserviceaccount.com]
travis_time:end:094e58e8:start=1718879231161222452,finish=1718879233036463614,duration=1875241162,event=script
The command "gcloud -q auth activate-service-account --key-file /tmp/[secure]_key.json;" exited with 0.
travis_time:start:25580c23
$ gcloud -q config set project ${GCE_PROJECT}
Updated property [core/project].
WARNING: You do not appear to have access to project [[secure]] or it does not exist.
travis_time:end:25580c23:start=1718879233053707833,finish=1718879234454368880,duration=1400661047,event=script
The command "gcloud -q config set project ${GCE_PROJECT}" exited with 0.
travis_time:start:0b104892
$ gcloud auth configure-docker
Adding credentials for all GCR repositories.
WARNING: A long list of credential helpers may cause delays running 'docker build'. We recommend passing the registry name to configure only the registry you are using.
Docker configuration file updated.
travis_time:end:0b104892:start=1718879234461795638,finish=1718879235970234197,duration=1508438559,event=script
The command "gcloud auth configure-docker" exited with 0.
travis_time:start:0a4564e8
$ sudo make docker-build
docker build -t [secure].io/[secure]/worker:5869728 .
Sending build context to Docker daemon  54.38MB


Step 1/16 : FROM golang:1.21 as builder
1.21: Pulling from library/golang
fea1432adf09: Pulling fs layer
5651b5803b18: Pulling fs layer
3873416e6a33: Pulling fs layer
6efb595508de: Pulling fs layer
98b7747f5ef5: Pulling fs layer
1a74743e93e9: Pulling fs layer
4f4fb700ef54: Pulling fs layer
6efb595508de: Waiting
98b7747f5ef5: Waiting
1a74743e93e9: Waiting
4f4fb700ef54: Waiting
5651b5803b18: Verifying Checksum
5651b5803b18: Download complete
fea1432adf09: Verifying Checksum
fea1432adf09: Download complete
3873416e6a33: Verifying Checksum
3873416e6a33: Download complete
1a74743e93e9: Verifying Checksum
1a74743e93e9: Download complete
4f4fb700ef54: Verifying Checksum
4f4fb700ef54: Download complete
6efb595508de: Verifying Checksum
6efb595508de: Download complete
98b7747f5ef5: Verifying Checksum
98b7747f5ef5: Download complete
fea1432adf09: Pull complete
5651b5803b18: Pull complete
3873416e6a33: Pull complete
6efb595508de: Pull complete
98b7747f5ef5: Pull complete
1a74743e93e9: Pull complete
4f4fb700ef54: Pull complete
Digest: sha256:2eb85b8942c29145b4a5bed2d0f3dc1a3ba2f823aec74afe16751da108a585e1
Status: Downloaded newer image for golang:1.21
 ---> 4b088a6b9b88
Step 2/16 : MAINTAINER Travis CI GmbH <support+travis-worker-docker-image@travis-ci.org>
 ---> Running in 1bb1a07fd550
Removing intermediate container 1bb1a07fd550
 ---> 35c71538c184
Step 3/16 : COPY . /go/src/github.com/travis-ci/worker
 ---> d60afca3713a
Step 4/16 : WORKDIR /go/src/github.com/travis-ci/worker
 ---> Running in 848dcd5a7d7a
Removing intermediate container 848dcd5a7d7a
 ---> 911fb49fb105
Step 5/16 : ENV CGO_ENABLED 0
 ---> Running in adffda5ab29a
Removing intermediate container adffda5ab29a
 ---> e7e3a14bae54
Step 6/16 : RUN make build
 ---> Running in 4f85aa2ee5be
GO111MODULE=on go mod download
make: bash: Operation not permitted
make: bash: Operation not permitted
make: bash: Operation not permitted
make: bash: Operation not permitted
make: bash: Operation not permitted
make: *** [Makefile:104: .deps-fetched] Error 127
The command '/bin/sh -c make build' returned a non-zero code: 2
Makefile:84: recipe for target 'docker-build' failed
make: *** [docker-build] Error 2
travis_time:end:0a4564e8:start=1718879235980345007,finish=1718879264412845640,duration=28432500633,event=script
The command "sudo make docker-build" exited with 2.
travis_time:start:0ae5e70e
$ make docker-push
./script/docker-push
time=2024-06-20T10:27:44Z msg="docker login"
WARNING! Your password will be stored unencrypted in /home/travis/.docker/config.json.
Configure a credential helper to remove this warning. See
https://docs.docker.com/engine/reference/commandline/login/#credentials-store

Login Succeeded
time=2024-06-20T10:27:44Z msg="docker push" dest=[secure].io/[secure]/worker:5869728 attempt=1
The push refers to repository [[secure].io/[secure]/worker]
An image does not exist locally with the tag: [secure].io/[secure]/worker
time=2024-06-20T10:27:45Z msg="sleeping" interval=10
time=2024-06-20T10:27:55Z msg="docker push" dest=[secure].io/[secure]/worker:5869728 attempt=2
The push refers to repository [[secure].io/[secure]/worker]
An image does not exist locally with the tag: [secure].io/[secure]/worker
time=2024-06-20T10:27:56Z msg="sleeping" interval=20
time=2024-06-20T10:28:16Z msg="docker push" dest=[secure].io/[secure]/worker:5869728 attempt=3
The push refers to repository [[secure].io/[secure]/worker]
An image does not exist locally with the tag: [secure].io/[secure]/worker
time=2024-06-20T10:28:16Z msg="sleeping" interval=30
time=2024-06-20T10:28:46Z msg="docker push" dest=[secure].io/[secure]/worker:5869728 attempt=4
The push refers to repository [[secure].io/[secure]/worker]
An image does not exist locally with the tag: [secure].io/[secure]/worker
time=2024-06-20T10:28:47Z msg="sleeping" interval=40
time=2024-06-20T10:29:27Z msg="docker push" dest=[secure].io/[secure]/worker:5869728 attempt=5
The push refers to repository [[secure].io/[secure]/worker]
An image does not exist locally with the tag: [secure].io/[secure]/worker
time=2024-06-20T10:29:28Z msg="sleeping" interval=50
time=2024-06-20T10:30:18Z msg="docker push" dest=[secure].io/[secure]/worker:5869728 attempt=6
The push refers to repository [[secure].io/[secure]/worker]
An image does not exist locally with the tag: [secure].io/[secure]/worker
time=2024-06-20T10:30:18Z msg="sleeping" interval=60
time=2024-06-20T10:31:18Z msg="docker push" dest=[secure].io/[secure]/worker:5869728 attempt=7
The push refers to repository [[secure].io/[secure]/worker]
An image does not exist locally with the tag: [secure].io/[secure]/worker
Makefile:53: recipe for target 'docker-push' failed
make: *** [docker-push] Error 86
travis_time:end:0ae5e70e:start=1718879264423978100,finish=1718879479526702279,duration=215102724179,event=script
The command "make docker-push" exited with 2.
travis_fold:start:before_cache
travis_time:start:042e3922
$ make clean
./script/clean
travis_time:end:042e3922:start=1718879479534018679,finish=1718879479664143760,duration=130125081,event=before_cache
travis_fold:end:before_cache
travis_fold:start:cache.2
store build cache
travis_time:start:07ecaf46
travis_time:end:07ecaf46:start=1718879479671234572,finish=1718879479675843338,duration=4608766,event=cache
travis_time:start:051d5d80
nothing changed
travis_time:end:051d5d80:start=1718879479681729474,finish=1718879483693193644,duration=4011464170,event=cache
travis_fold:end:cache.2


Done. Your build exited with 1.