travis_fold:start:worker_info
Worker information
hostname: af29ad15-eaaf-417a-9efc-343dfb197fa9@1.worker-n2-com-779d777f7b-rxlft.gce-production-1
version: 6.2.22 https://github.com/travis-ci/worker/tree/858cb91994a513269f2fe9782c15fc113e966231
instance: travis-job-2bab4956-f98e-4df8-848d-1da0b5ca965e travis-ci-sardonyx-xenial-1684402799-0876f6f0 (via amqp)
startup: 6.313266384s
travis_fold:end:worker_info
travis_time:start:2129495a
travis_time:end:2129495a:start=1718877806220339543,finish=1718877806369730910,duration=149391367,event=no_world_writable_dirs
travis_time:start:257d51e4
travis_time:end:257d51e4:start=1718877806372333103,finish=1718877806375291474,duration=2958371,event=setup_filter
travis_time:start:0198a964
travis_time:end:0198a964:start=1718877806379997915,finish=1718877806390056098,duration=10058183,event=agent
travis_time:start:112796d0
travis_time:end:112796d0:start=1718877806393100251,finish=1718877806395044387,duration=1944136,event=check_unsupported
travis_time:start:3c0f07b0
travis_fold:start:system_info
Build system information
Build language: go
Build dist: xenial
Build id: 271051059
Job id: 623156360
Runtime kernel version: 4.15.0-1098-gcp
travis-build version: 3484ecfe
Build image provisioning date and time
Thu May 18 10:07:51 UTC 2023
Operating System Details
Distributor ID:	Ubuntu
Description:	Ubuntu 16.04.7 LTS
Release:	16.04
Codename:	xenial
Systemd Version
systemd 229
Cookbooks Version
d19e5ff https://github.com/travis-ci/travis-cookbooks/tree/d19e5ff
git version
git version 2.40.1
bash version
GNU bash, version 4.3.48(1)-release (x86_64-pc-linux-gnu)
gcc version
gcc (Ubuntu 5.4.0-6ubuntu1~16.04.12) 5.4.0 20160609
docker version
Client: Docker Engine - Community
 Version:           20.10.7
 API version:       1.41
 Go version:        go1.13.15
 Git commit:        f0df350
 Built:             Wed Jun  2 11:56:47 2021
 OS/Arch:           linux/amd64
 Context:           default
 Experimental:      true

Server: Docker Engine - Community
 Engine:
  Version:          20.10.7
  API version:      1.41 (minimum version 1.12)
  Go version:       go1.13.15
  Git commit:       b0f5bc3
  Built:            Wed Jun  2 11:54:58 2021
  OS/Arch:          linux/amd64
  Experimental:     false
 containerd:
  Version:          1.4.6
  GitCommit:        d71fcd7d8303cbf684402823e425e9dd2e99285d
 runc:
  Version:          1.0.0-rc95
  GitCommit:        b9ee9c6314599f1b4a7f497e1f1f856fe433d3b7
 docker-init:
  Version:          0.19.0
  GitCommit:        de40ad0
clang version
clang version 7.0.0 (tags/RELEASE_700/final)
jq version
jq-1.6
bats version
Bats 0.4.0
shellcheck version
0.7.2
shfmt version
v3.2.1
ccache version
3.2.4
cmake version
cmake version 3.26.3
heroku version
heroku/8.1.3 linux-x64 node-v16.19.0
imagemagick version
Version: ImageMagick 6.8.9-9 Q16 x86_64 2020-12-04 http://www.imagemagick.org
md5deep version
4.4
mercurial version
version 5.9.3
mysql version
mysql  Ver 14.14 Distrib 5.7.33, for Linux (x86_64) using  EditLine wrapper
openssl version
OpenSSL 1.0.2g  1 Mar 2016
packer version
1.7.5
postgresql client version
psql (PostgreSQL) 10.17 (Ubuntu 10.17-1.pgdg16.04+1)
ragel version
Ragel State Machine Compiler version 6.8 Feb 2013
sudo version
1.8.16
gzip version
gzip 1.6
zip version
Zip 3.0
vim version
VIM - Vi IMproved 7.4 (2013 Aug 10, compiled Oct 13 2020 16:04:38)
iptables version
iptables v1.6.0
curl version
curl 7.47.0 (x86_64-pc-linux-gnu) libcurl/7.47.0 GnuTLS/3.4.10 zlib/1.2.8 libidn/1.32 librtmp/2.3
wget version
GNU Wget 1.17.1 built on linux-gnu.
rsync version
rsync  version 3.1.1  protocol version 31
gimme version
v1.5.4
nvm version
0.39.3
perlbrew version
/home/travis/perl5/perlbrew/bin/perlbrew  - App::perlbrew/0.95
phpenv version
rbenv 1.2.0
rvm version
rvm 1.29.12 (latest) by Michal Papis, Piotr Kuczynski, Wayne E. Seguin [https://rvm.io]
default ruby version
ruby 2.7.6p219 (2022-04-12 revision c9c2245c0a) [x86_64-linux]
default python version
Python 3.7.13
CouchDB version
couchdb 1.6.1
ElasticSearch version
7.16.3
Installed Firefox version
firefox 63.0.1
MongoDB version
MongoDB 4.4.21
PhantomJS version
2.1.1
Pre-installed PostgreSQL versions
9.4.26
9.5.25
9.6.22
Redis version
redis-server 6.0.6
Pre-installed Go versions
1.18.4
ant version
Apache Ant(TM) version 1.9.6 compiled on July 20 2018
mvn version
Apache Maven 3.8.8 (4c87b05d9aedce574290d1acc98575ed5eb6cd39)
gradle version
Gradle 7.5.1!
lein version
Leiningen 2.10.0 on Java 11.0.15.1 OpenJDK 64-Bit Server VM
Pre-installed Node.js versions
v10.24.1
v12.22.12
v14.21.3
v16.15
v16.16.0
v16.20.0
v18.16.0
v4.9.1
v6.17.1
v8.17.0
phpenv versions
  system
  7.4
* 7.4.30 (set by /home/travis/.phpenv/version)
  hhvm-stable
  hhvm
composer --version
Composer version 2.3.7 2022-06-06 16:43:28
Pre-installed Ruby versions
ruby-2.7.6
ruby-3.0.4
ruby-3.1.2
travis_fold:end:system_info

travis_time:end:3c0f07b0:start=1718877806398182628,finish=1718877806407396462,duration=9213834,event=show_system_info
travis_time:start:05644f1e
travis_time:end:05644f1e:start=1718877806414895091,finish=1718877806441594242,duration=26699151,event=rm_riak_source
travis_time:start:16efc229
travis_time:end:16efc229:start=1718877806449755812,finish=1718877806459803092,duration=10047280,event=fix_rwky_redis
travis_time:start:12527248
travis_time:end:12527248:start=1718877806480425308,finish=1718877807170824168,duration=690398860,event=wait_for_network
travis_time:start:15ee1314
travis_time:end:15ee1314:start=1718877807175135224,finish=1718877829077526846,duration=21902391622,event=update_apt_keys
travis_time:start:15588c00
travis_time:end:15588c00:start=1718877829082357307,finish=1718877829134401132,duration=52043825,event=fix_hhvm_source
travis_time:start:0b4006e0
travis_time:end:0b4006e0:start=1718877829139608449,finish=1718877829142241340,duration=2632891,event=update_mongo_arch
travis_time:start:1a9546e8
travis_time:end:1a9546e8:start=1718877829146428283,finish=1718877829186679463,duration=40251180,event=fix_sudo_enabled_trusty
travis_time:start:1ae83273
travis_time:end:1ae83273:start=1718877829191718406,finish=1718877829194281563,duration=2563157,event=update_glibc
travis_time:start:010476c8
travis_time:end:010476c8:start=1718877829202430629,finish=1718877829232215254,duration=29784625,event=clean_up_path
travis_time:start:0668b49b
travis_time:end:0668b49b:start=1718877829238825666,finish=1718877829247588168,duration=8762502,event=fix_resolv_conf
travis_time:start:015a60da
travis_time:end:015a60da:start=1718877829251428615,finish=1718877829260467121,duration=9038506,event=fix_etc_hosts
travis_time:start:2165d3d1
travis_time:end:2165d3d1:start=1718877829265196118,finish=1718877829273678695,duration=8482577,event=fix_mvn_settings_xml
travis_time:start:03c4e612
travis_time:end:03c4e612:start=1718877829277373377,finish=1718877829286734765,duration=9361388,event=no_ipv6_localhost
travis_time:start:03e9989d
travis_time:end:03e9989d:start=1718877829291197914,finish=1718877829294365991,duration=3168077,event=fix_etc_mavenrc
travis_time:start:025e52c4
OK
travis_time:end:025e52c4:start=1718877829298389288,finish=1718877829617808161,duration=319418873,event=fix_perforce_key
travis_time:start:043f7d4e
travis_time:end:043f7d4e:start=1718877829625656418,finish=1718877829630386269,duration=4729851,event=fix_wwdr_certificate
travis_time:start:1f7d2cc7
travis_time:end:1f7d2cc7:start=1718877829637764208,finish=1718877829661649148,duration=23884940,event=put_localhost_first
travis_time:start:080d5892
travis_time:end:080d5892:start=1718877829667386223,finish=1718877829670447412,duration=3061189,event=home_paths
travis_time:start:38a5758e
travis_time:end:38a5758e:start=1718877829677072199,finish=1718877829689532052,duration=12459853,event=disable_initramfs
travis_time:start:03b70bb5
travis_time:end:03b70bb5:start=1718877829696213206,finish=1718877829953651423,duration=257438217,event=disable_ssh_roaming
travis_time:start:09edf838
travis_time:end:09edf838:start=1718877829958966192,finish=1718877829961369635,duration=2403443,event=debug_tools
travis_time:start:02abd0e7
travis_time:end:02abd0e7:start=1718877829966130836,finish=1718877829969813033,duration=3682197,event=uninstall_oclint
travis_time:start:0a89179a
travis_time:end:0a89179a:start=1718877829977373988,finish=1718877829980634993,duration=3261005,event=rvm_use
travis_time:start:0ab2e346
travis_time:end:0ab2e346:start=1718877829984228739,finish=1718877829991736085,duration=7507346,event=rm_etc_boto_cfg
travis_time:start:0215570a
travis_time:end:0215570a:start=1718877829997099323,finish=1718877829999961184,duration=2861861,event=rm_oraclejdk8_symlink
travis_time:start:00722e41
travis_time:end:00722e41:start=1718877830005240174,finish=1718877830090354799,duration=85114625,event=enable_i386
travis_time:start:0da1054c
travis_time:end:0da1054c:start=1718877830095543820,finish=1718877830099298195,duration=3754375,event=update_rubygems
travis_time:start:173676e4
travis_time:end:173676e4:start=1718877830104919455,finish=1718877830958145473,duration=853226018,event=ensure_path_components
travis_time:start:00217da4
travis_time:end:00217da4:start=1718877830964977323,finish=1718877830967415942,duration=2438619,event=redefine_curl
travis_time:start:2834adfe
travis_time:end:2834adfe:start=1718877830972998961,finish=1718877831078659079,duration=105660118,event=nonblock_pipe
travis_time:start:1df9a2ac
travis_time:end:1df9a2ac:start=1718877831086704553,finish=1718877845409789727,duration=14323085174,event=apt_get_update
travis_time:start:0691cf98
travis_time:end:0691cf98:start=1718877845414087682,finish=1718877845417196005,duration=3108323,event=deprecate_xcode_64
travis_time:start:099c19dd
travis_time:end:099c19dd:start=1718877845421156141,finish=1718877848930551556,duration=3509395415,event=update_heroku
travis_time:start:04082560
travis_time:end:04082560:start=1718877848935082444,finish=1718877848938303819,duration=3221375,event=shell_session_update
travis_time:start:05536e28
travis_fold:start:docker_mtu_and_registry_mirrors
travis_fold:end:docker_mtu_and_registry_mirrors
travis_time:end:05536e28:start=1718877848949311375,finish=1718877852601817463,duration=3652506088,event=set_docker_mtu_and_registry_mirrors
travis_time:start:019b7a74
travis_fold:start:resolvconf
travis_fold:end:resolvconf
travis_time:end:019b7a74:start=1718877852614142067,finish=1718877852677591979,duration=63449912,event=resolvconf
travis_time:start:39076d8a
travis_time:end:39076d8a:start=1718877852683674026,finish=1718877852814246773,duration=130572747,event=maven_central_mirror
travis_time:start:0c49c3c8
travis_time:end:0c49c3c8:start=1718877852822624653,finish=1718877852914238275,duration=91613622,event=maven_https
travis_fold:start:apt
travis_time:start:14231ed8
$ travis_apt_get_update
travis_time:end:14231ed8:start=1718877852919479447,finish=1718877859662199033,duration=6742719586,event=prepare
Installing APT Packages
travis_time:start:023fa260
$ sudo -E apt-get -yq --no-install-suggests --no-install-recommends $(travis_apt_get_options) install docker-ce
Reading package lists...
Building dependency tree...
Reading state information...
docker-ce is already the newest version (5:20.10.7~3-0~ubuntu-xenial).
0 upgraded, 0 newly installed, 0 to remove and 23 not upgraded.
travis_time:end:023fa260:start=1718877859672931107,finish=1718877860247347937,duration=574416830,event=prepare
travis_fold:end:apt

travis_fold:start:snap
Installing 2 Snaps
travis_time:start:0754c25a
$ sudo snap install core

Ensure prerequisites for "core" are available                                  /
Download snap "core" (16928) from channel "stable"                             -
Download snap "core" (16928) from channel "stable"                             \
Download snap "core" (16928) from channel "stable"                             |
Download snap "core" (16928) from channel "stable"                             /
Download snap "core" (16928) from channel "stable"                             -
Download snap "core" (16928) from channel "stable"                             \
Download snap "core" (16928) from channel "stable"                             |
Download snap "core" (16928) from channel "stable"                             /
Download snap "core" (16928) from channel "stable"                             -
Download snap "core" (16928) from channel "stable"                             \
Download snap "core" (16928) from channel "stable"                             |
Download snap "core" (16928) from channel "stable"                             /[?25l
Download snap "core" (16928) from channel "stable"             0%     0B/s ages!
Download snap "core" (16928) from channel "stable"             0%     0B/s ages!
Download snap "core" (16928) from channel "stable"             0%     0B/s ages!
Download snap "core" (16928) from channel "stable"             0%  564kB/s 3m13s
Download snap "core" (16928) from channel "stable"             0%  904kB/s 2m00s
Download snap "core" (16928) from channel "stable"             1% 1.88MB/s 57.3s
Download snap "core" (16928) from channel "stable"             2% 2.91MB/s 36.8s
Download snap "core" (16928) from channel "stable"             4% 5.09MB/s 20.6s
Download snap "core" (16928) from channel "stable"             6% 7.29MB/s 14.1s
Download snap "core" (16928) from channel "stable"             9% 9.27MB/s 10.8s
Download snap "core" (16928) from channel "stable"            11% 10.7MB/s 9.09s
Download snap "core" (16928) from channel "stable"            13% 11.9MB/s 7.97s
Download snap "core" (16928) from channel "stable"            16% 12.9MB/s 7.16s
Download snap "core" (16928) from channel "stable"            18% 13.9MB/s 6.43s
Download snap "core" (16928) from channel "stable"            21% 14.8MB/s 5.86s
Download snap "core" (16928) from channel "stable"            23% 15.3MB/s 5.53s
Download snap "core" (16928) from channel "stable"            25% 15.7MB/s 5.23s
Download snap "core" (16928) from channel "stable"            27% 16.1MB/s 4.96s
Download snap "core" (16928) from channel "stable"            30% 16.8MB/s 4.58s
Download snap "core" (16928) from channel "stable"            32% 17.3MB/s 4.28s
Download snap "core" (16928) from channel "stable"            34% 17.7MB/s 4.05s
Download snap "core" (16928) from channel "stable"            37% 18.1MB/s 3.80s
Download snap "core" (16928) from channel "stable"            39% 18.5MB/s 3.57s
Download snap "core" (16928) from channel "stable"            42% 18.8MB/s 3.39s
Download snap "core" (16928) from channel "stable"            44% 19.1MB/s 3.19s
Download snap "core" (16928) from channel "stable"            46% 19.1MB/s 3.07s
Download snap "core" (16928) from channel "stable"            48% 19.3MB/s 2.93s
Download snap "core" (16928) from channel "stable"            50% 19.4MB/s 2.80s
Download snap "core" (16928) from channel "stable"            53% 19.7MB/s 2.60s
Download snap "core" (16928) from channel "stable"            56% 20.0MB/s 2.43s
Download snap "core" (16928) from channel "stable"            58% 20.2MB/s 2.26s
Download snap "core" (16928) from channel "stable"            61% 20.4MB/s 2.11s
Download snap "core" (16928) from channel "stable"            63% 20.6MB/s 1.95s
Download snap "core" (16928) from channel "stable"            65% 20.8MB/s 1.82s
Download snap "core" (16928) from channel "stable"            68% 20.9MB/s 1.69s
Download snap "core" (16928) from channel "stable"            70% 20.9MB/s 1.58s
Download snap "core" (16928) from channel "stable"            72% 21.0MB/s 1.45s
Download snap "core" (16928) from channel "stable"            74% 21.1MB/s 1.32s
Download snap "core" (16928) from channel "stable"            77% 21.3MB/s 1.17s
Download snap "core" (16928) from channel "stable"            80% 21.5MB/s 1.03s
Download snap "core" (16928) from channel "stable"            82% 21.6MB/s 914ms
Download snap "core" (16928) from channel "stable"            84% 21.5MB/s 819ms
Download snap "core" (16928) from channel "stable"            87% 21.7MB/s 676ms
Download snap "core" (16928) from channel "stable"            89% 21.9MB/s 546ms
Download snap "core" (16928) from channel "stable"            91% 21.9MB/s 442ms
Download snap "core" (16928) from channel "stable"            94% 22.0MB/s 315ms
Download snap "core" (16928) from channel "stable"            96% 21.9MB/s 221ms
Download snap "core" (16928) from channel "stable"            98% 22.0MB/s 107ms
Download snap "core" (16928) from channel "stable"           100% 22.0MB/s 0.0ns
Download snap "core" (16928) from channel "stable"           100% 21.6MB/s 0.0ns
Download snap "core" (16928) from channel "stable"           100% 21.2MB/s 0.0ns
Download snap "core" (16928) from channel "stable"           100% 20.8MB/s 0.0ns
Fetch and check assertions for snap "core" (16928)                             -
Fetch and check assertions for snap "core" (16928)                             \
Fetch and check assertions for snap "core" (16928)                             |
Fetch and check assertions for snap "core" (16928)                             /
Fetch and check assertions for snap "core" (16928)                             -
Fetch and check assertions for snap "core" (16928)                             \
Fetch and check assertions for snap "core" (16928)                             |
Fetch and check assertions for snap "core" (16928)                             /
Fetch and check assertions for snap "core" (16928)                             -
Fetch and check assertions for snap "core" (16928)                             \
Mount snap "core" (16928)                                                      |
Mount snap "core" (16928)                                                      /
Mount snap "core" (16928)                                                      -
Mount snap "core" (16928)                                                      \
Mount snap "core" (16928)                                                      |
Mount snap "core" (16928)                                                      /
Mount snap "core" (16928)                                                      -
Setup snap "core" (16928) security profiles                                    \
Setup snap "core" (16928) security profiles                                    |
Automatically connect eligible plugs and slots of snap "core"                  /
2024-06-20T10:04:30Z INFO Waiting for automatic snapd restart...

Automatically connect eligible plugs and slots of snap "core"                  -
Run health check of "core" snap                                                \
[?25hcore 16-2.61.2 from Canonical* installed
travis_time:end:0754c25a:start=1718877860251632224,finish=1718877872420178888,duration=12168546664,event=prepare
travis_time:start:1b96b021
$ sudo snap install google-cloud-sdk --classic

Ensure prerequisites for "google-cloud-sdk" are available                      /
Ensure prerequisites for "google-cloud-sdk" are available                      -
Ensure prerequisites for "google-cloud-sdk" are available                      \
Download snap "core20" (2318) from channel "stable"                            |
Download snap "core20" (2318) from channel "stable"                            /
Download snap "core20" (2318) from channel "stable"                            -
Download snap "core20" (2318) from channel "stable"                            \
Download snap "core20" (2318) from channel "stable"                            |
Download snap "core20" (2318) from channel "stable"                            /
Download snap "core20" (2318) from channel "stable"                            -
Download snap "core20" (2318) from channel "stable"                            \
Download snap "core20" (2318) from channel "stable"                            |[?25l
Download snap "core20" (2318) from channel "stable"            0%     0B/s ages!
Download snap "core20" (2318) from channel "stable"            0%     0B/s ages!
Download snap "core20" (2318) from channel "stable"            0%  481kB/s 2m19s
Download snap "core20" (2318) from channel "stable"            0%  724kB/s 1m32s
Download snap "core20" (2318) from channel "stable"            1% 1.16MB/s 57.4s
Download snap "core20" (2318) from channel "stable"            2% 1.93MB/s 34.1s
Download snap "core20" (2318) from channel "stable"            3% 3.11MB/s 20.9s
Download snap "core20" (2318) from channel "stable"            6% 5.07MB/s 12.4s
Download snap "core20" (2318) from channel "stable"           10% 7.25MB/s 8.34s
Download snap "core20" (2318) from channel "stable"           14% 9.13MB/s 6.33s
Download snap "core20" (2318) from channel "stable"           18% 10.5MB/s 5.25s
Download snap "core20" (2318) from channel "stable"           21% 11.8MB/s 4.45s
Download snap "core20" (2318) from channel "stable"           25% 12.9MB/s 3.87s
Download snap "core20" (2318) from channel "stable"           29% 13.9MB/s 3.41s
Download snap "core20" (2318) from channel "stable"           33% 14.6MB/s 3.07s
Download snap "core20" (2318) from channel "stable"           37% 15.1MB/s 2.81s
Download snap "core20" (2318) from channel "stable"           40% 15.7MB/s 2.55s
Download snap "core20" (2318) from channel "stable"           45% 16.4MB/s 2.26s
Download snap "core20" (2318) from channel "stable"           48% 16.8MB/s 2.07s
Download snap "core20" (2318) from channel "stable"           52% 17.2MB/s 1.88s
Download snap "core20" (2318) from channel "stable"           56% 17.5MB/s 1.70s
Download snap "core20" (2318) from channel "stable"           59% 17.9MB/s 1.53s
Download snap "core20" (2318) from channel "stable"           63% 18.2MB/s 1.35s
Download snap "core20" (2318) from channel "stable"           68% 18.7MB/s 1.16s
Download snap "core20" (2318) from channel "stable"           71% 18.9MB/s 1.01s
Download snap "core20" (2318) from channel "stable"           75% 19.1MB/s 882ms
Download snap "core20" (2318) from channel "stable"           79% 19.3MB/s 743ms
Download snap "core20" (2318) from channel "stable"           82% 19.5MB/s 607ms
Download snap "core20" (2318) from channel "stable"           86% 19.7MB/s 475ms
Download snap "core20" (2318) from channel "stable"           90% 20.0MB/s 320ms
Download snap "core20" (2318) from channel "stable"           95% 20.2MB/s 178ms
Download snap "core20" (2318) from channel "stable"           99% 20.4MB/s  47ms
Download snap "core20" (2318) from channel "stable"          100% 20.1MB/s 0.0ns
Download snap "core20" (2318) from channel "stable"          100% 19.5MB/s 0.0ns
Fetch and check assertions for snap "core20" (2318)                            /
Fetch and check assertions for snap "core20" (2318)                            -
Fetch and check assertions for snap "core20" (2318)                            \
Fetch and check assertions for snap "core20" (2318)                            |
Fetch and check assertions for snap "core20" (2318)                            /
Mount snap "core20" (2318)                                                     -
Mount snap "core20" (2318)                                                     \
Mount snap "core20" (2318)                                                     |
Mount snap "core20" (2318)                                                     /
Mount snap "core20" (2318)                                                     -
Download snap "google-cloud-sdk" (460) from channel "stable"                   \
Download snap "google-cloud-sdk" (460) from channel "stable"                   |
Download snap "google-cloud-sdk" (460) from channel "stable"                   /
Download snap "google-cloud-sdk" (460) from channel "stable"                   -
Download snap "google-cloud-sdk" (460) from channel "stable"                   \
Download snap "google-cloud-sdk" (460) from channel "stable"                   |
Download snap "google-cloud-sdk" (460) from channel "stable"                   /
Download snap "google-cloud-sdk" (460) from channel "stable"                   -[?25l
Download snap "google-cloud-sdk" (460) from channel "stable"   0%     0B/s ages!
Download snap "google-cloud-sdk" (460) from channel "stable"   0%     0B/s ages!
Download snap "google-cloud-sdk" (460) from channel "stable"   0%     0B/s ages!
Download snap "google-cloud-sdk" (460) from channel "stable"   0%     0B/s ages!
Download snap "google-cloud-sdk" (460) from channel "stable"   0%     0B/s ages!
Download snap "google-cloud-sdk" (460) from channel "stable"   0% 1.23MB/s 4m59s
Download snap "google-cloud-sdk" (460) from channel "stable"   0% 2.12MB/s 2m54s
Download snap "google-cloud-sdk" (460) from channel "stable"   1% 3.70MB/s 1m39s
Download snap "google-cloud-sdk" (460) from channel "stable"   2% 6.59MB/s 55.3s
Download snap "google-cloud-sdk" (460) from channel "stable"   2% 8.15MB/s 44.4s
Download snap "google-cloud-sdk" (460) from channel "stable"   3% 10.1MB/s 35.5s
Download snap "google-cloud-sdk" (460) from channel "stable"   4% 11.1MB/s 32.1s
Download snap "google-cloud-sdk" (460) from channel "stable"   4% 12.5MB/s 28.2s
Download snap "google-cloud-sdk" (460) from channel "stable"   5% 13.2MB/s 26.6s
Download snap "google-cloud-sdk" (460) from channel "stable"   6% 14.3MB/s 24.3s
Download snap "google-cloud-sdk" (460) from channel "stable"   6% 14.8MB/s 23.4s
Download snap "google-cloud-sdk" (460) from channel "stable"   7% 15.3MB/s 22.6s
Download snap "google-cloud-sdk" (460) from channel "stable"   8% 16.1MB/s 21.2s
Download snap "google-cloud-sdk" (460) from channel "stable"   9% 16.4MB/s 20.7s
Download snap "google-cloud-sdk" (460) from channel "stable"   9% 16.7MB/s 20.2s
Download snap "google-cloud-sdk" (460) from channel "stable"  10% 17.3MB/s 19.3s
Download snap "google-cloud-sdk" (460) from channel "stable"  11% 17.9MB/s 18.5s
Download snap "google-cloud-sdk" (460) from channel "stable"  11% 18.0MB/s 18.2s
Download snap "google-cloud-sdk" (460) from channel "stable"  12% 18.5MB/s 17.6s
Download snap "google-cloud-sdk" (460) from channel "stable"  13% 18.7MB/s 17.3s
Download snap "google-cloud-sdk" (460) from channel "stable"  13% 18.8MB/s 17.1s
Download snap "google-cloud-sdk" (460) from channel "stable"  14% 18.9MB/s 16.8s
Download snap "google-cloud-sdk" (460) from channel "stable"  15% 19.3MB/s 16.3s
Download snap "google-cloud-sdk" (460) from channel "stable"  15% 19.4MB/s 16.1s
Download snap "google-cloud-sdk" (460) from channel "stable"  16% 19.8MB/s 15.7s
Download snap "google-cloud-sdk" (460) from channel "stable"  17% 19.8MB/s 15.5s
Download snap "google-cloud-sdk" (460) from channel "stable"  18% 20.1MB/s 15.1s
Download snap "google-cloud-sdk" (460) from channel "stable"  18% 20.2MB/s 15.0s
Download snap "google-cloud-sdk" (460) from channel "stable"  19% 20.5MB/s 14.6s
Download snap "google-cloud-sdk" (460) from channel "stable"  20% 20.7MB/s 14.3s
Download snap "google-cloud-sdk" (460) from channel "stable"  20% 20.8MB/s 14.2s
Download snap "google-cloud-sdk" (460) from channel "stable"  21% 20.8MB/s 14.0s
Download snap "google-cloud-sdk" (460) from channel "stable"  22% 21.1MB/s 13.7s
Download snap "google-cloud-sdk" (460) from channel "stable"  22% 20.9MB/s 13.8s
Download snap "google-cloud-sdk" (460) from channel "stable"  23% 21.1MB/s 13.5s
Download snap "google-cloud-sdk" (460) from channel "stable"  24% 21.1MB/s 13.4s
Download snap "google-cloud-sdk" (460) from channel "stable"  25% 21.3MB/s 13.1s
Download snap "google-cloud-sdk" (460) from channel "stable"  25% 21.5MB/s 12.8s
Download snap "google-cloud-sdk" (460) from channel "stable"  26% 21.7MB/s 12.6s
Download snap "google-cloud-sdk" (460) from channel "stable"  27% 21.9MB/s 12.4s
Download snap "google-cloud-sdk" (460) from channel "stable"  28% 21.9MB/s 12.2s
Download snap "google-cloud-sdk" (460) from channel "stable"  28% 21.9MB/s 12.1s
Download snap "google-cloud-sdk" (460) from channel "stable"  29% 21.9MB/s 12.0s
Download snap "google-cloud-sdk" (460) from channel "stable"  30% 22.1MB/s 11.8s
Download snap "google-cloud-sdk" (460) from channel "stable"  30% 22.1MB/s 11.7s
Download snap "google-cloud-sdk" (460) from channel "stable"  31% 22.1MB/s 11.6s
Download snap "google-cloud-sdk" (460) from channel "stable"  32% 22.2MB/s 11.4s
Download snap "google-cloud-sdk" (460) from channel "stable"  32% 22.2MB/s 11.3s
Download snap "google-cloud-sdk" (460) from channel "stable"  33% 22.4MB/s 11.1s
Download snap "google-cloud-sdk" (460) from channel "stable"  34% 22.5MB/s 10.9s
Download snap "google-cloud-sdk" (460) from channel "stable"  34% 22.5MB/s 10.8s
Download snap "google-cloud-sdk" (460) from channel "stable"  35% 22.5MB/s 10.7s
Download snap "google-cloud-sdk" (460) from channel "stable"  36% 22.6MB/s 10.5s
Download snap "google-cloud-sdk" (460) from channel "stable"  36% 22.6MB/s 10.4s
Download snap "google-cloud-sdk" (460) from channel "stable"  37% 22.6MB/s 10.3s
Download snap "google-cloud-sdk" (460) from channel "stable"  38% 22.7MB/s 10.1s
Download snap "google-cloud-sdk" (460) from channel "stable"  39% 22.7MB/s 10.0s
Download snap "google-cloud-sdk" (460) from channel "stable"  39% 22.7MB/s 9.93s
Download snap "google-cloud-sdk" (460) from channel "stable"  40% 22.8MB/s 9.75s
Download snap "google-cloud-sdk" (460) from channel "stable"  41% 22.9MB/s 9.58s
Download snap "google-cloud-sdk" (460) from channel "stable"  42% 23.0MB/s 9.40s
Download snap "google-cloud-sdk" (460) from channel "stable"  42% 23.0MB/s 9.31s
Download snap "google-cloud-sdk" (460) from channel "stable"  43% 23.1MB/s 9.14s
Download snap "google-cloud-sdk" (460) from channel "stable"  44% 23.1MB/s 9.05s
Download snap "google-cloud-sdk" (460) from channel "stable"  44% 23.1MB/s 8.96s
Download snap "google-cloud-sdk" (460) from channel "stable"  45% 23.0MB/s 8.94s
Download snap "google-cloud-sdk" (460) from channel "stable"  45% 22.9MB/s 8.84s
Download snap "google-cloud-sdk" (460) from channel "stable"  46% 22.9MB/s 8.75s
Download snap "google-cloud-sdk" (460) from channel "stable"  47% 23.0MB/s 8.58s
Download snap "google-cloud-sdk" (460) from channel "stable"  47% 23.1MB/s 8.42s
Download snap "google-cloud-sdk" (460) from channel "stable"  48% 23.1MB/s 8.33s
Download snap "google-cloud-sdk" (460) from channel "stable"  48% 22.9MB/s 8.37s
Download snap "google-cloud-sdk" (460) from channel "stable"  49% 22.9MB/s 8.27s
Download snap "google-cloud-sdk" (460) from channel "stable"  49% 22.9MB/s 8.18s
Download snap "google-cloud-sdk" (460) from channel "stable"  50% 22.8MB/s 8.15s
Download snap "google-cloud-sdk" (460) from channel "stable"  50% 22.7MB/s 8.12s
Download snap "google-cloud-sdk" (460) from channel "stable"  51% 22.8MB/s 7.95s
Download snap "google-cloud-sdk" (460) from channel "stable"  52% 22.8MB/s 7.79s
Download snap "google-cloud-sdk" (460) from channel "stable"  53% 22.9MB/s 7.64s
Download snap "google-cloud-sdk" (460) from channel "stable"  53% 22.8MB/s 7.60s
Download snap "google-cloud-sdk" (460) from channel "stable"  54% 22.9MB/s 7.45s
Download snap "google-cloud-sdk" (460) from channel "stable"  55% 23.0MB/s 7.29s
Download snap "google-cloud-sdk" (460) from channel "stable"  55% 23.0MB/s 7.19s
Download snap "google-cloud-sdk" (460) from channel "stable"  56% 23.1MB/s 7.04s
Download snap "google-cloud-sdk" (460) from channel "stable"  57% 23.1MB/s 6.89s
Download snap "google-cloud-sdk" (460) from channel "stable"  58% 23.1MB/s 6.79s
Download snap "google-cloud-sdk" (460) from channel "stable"  58% 23.1MB/s 6.70s
Download snap "google-cloud-sdk" (460) from channel "stable"  59% 23.0MB/s 6.66s
Download snap "google-cloud-sdk" (460) from channel "stable"  59% 22.9MB/s 6.68s
Download snap "google-cloud-sdk" (460) from channel "stable"  59% 22.8MB/s 6.63s
Download snap "google-cloud-sdk" (460) from channel "stable"  60% 22.8MB/s 6.48s
Download snap "google-cloud-sdk" (460) from channel "stable"  60% 22.8MB/s 6.44s
Download snap "google-cloud-sdk" (460) from channel "stable"  61% 22.8MB/s 6.34s
Download snap "google-cloud-sdk" (460) from channel "stable"  61% 22.5MB/s 6.41s
Download snap "google-cloud-sdk" (460) from channel "stable"  61% 22.4MB/s 6.36s
Download snap "google-cloud-sdk" (460) from channel "stable"  62% 22.4MB/s 6.32s
Download snap "google-cloud-sdk" (460) from channel "stable"  63% 22.4MB/s 6.16s
Download snap "google-cloud-sdk" (460) from channel "stable"  63% 22.4MB/s 6.06s
Download snap "google-cloud-sdk" (460) from channel "stable"  64% 22.4MB/s 5.96s
Download snap "google-cloud-sdk" (460) from channel "stable"  65% 22.5MB/s 5.81s
Download snap "google-cloud-sdk" (460) from channel "stable"  65% 22.5MB/s 5.71s
Download snap "google-cloud-sdk" (460) from channel "stable"  66% 22.6MB/s 5.56s
Download snap "google-cloud-sdk" (460) from channel "stable"  67% 22.6MB/s 5.46s
Download snap "google-cloud-sdk" (460) from channel "stable"  68% 22.6MB/s 5.31s
Download snap "google-cloud-sdk" (460) from channel "stable"  68% 22.6MB/s 5.22s
Download snap "google-cloud-sdk" (460) from channel "stable"  69% 22.7MB/s 5.07s
Download snap "google-cloud-sdk" (460) from channel "stable"  70% 22.7MB/s 4.97s
Download snap "google-cloud-sdk" (460) from channel "stable"  70% 22.8MB/s 4.83s
Download snap "google-cloud-sdk" (460) from channel "stable"  71% 22.7MB/s 4.73s
Download snap "google-cloud-sdk" (460) from channel "stable"  72% 22.7MB/s 4.63s
Download snap "google-cloud-sdk" (460) from channel "stable"  72% 22.8MB/s 4.49s
Download snap "google-cloud-sdk" (460) from channel "stable"  73% 22.9MB/s 4.34s
Download snap "google-cloud-sdk" (460) from channel "stable"  74% 22.9MB/s 4.25s
Download snap "google-cloud-sdk" (460) from channel "stable"  74% 22.8MB/s 4.15s
Download snap "google-cloud-sdk" (460) from channel "stable"  75% 22.9MB/s 4.01s
Download snap "google-cloud-sdk" (460) from channel "stable"  76% 22.9MB/s 3.91s
Download snap "google-cloud-sdk" (460) from channel "stable"  76% 22.9MB/s 3.81s
Download snap "google-cloud-sdk" (460) from channel "stable"  77% 22.9MB/s 3.67s
Download snap "google-cloud-sdk" (460) from channel "stable"  78% 22.9MB/s 3.62s
Download snap "google-cloud-sdk" (460) from channel "stable"  78% 22.7MB/s 3.65s
Download snap "google-cloud-sdk" (460) from channel "stable"  78% 22.6MB/s 3.59s
Download snap "google-cloud-sdk" (460) from channel "stable"  78% 22.5MB/s 3.58s
Download snap "google-cloud-sdk" (460) from channel "stable"  79% 22.5MB/s 3.48s
Download snap "google-cloud-sdk" (460) from channel "stable"  80% 22.6MB/s 3.33s
Download snap "google-cloud-sdk" (460) from channel "stable"  80% 22.6MB/s 3.23s
Download snap "google-cloud-sdk" (460) from channel "stable"  81% 22.6MB/s 3.09s
Download snap "google-cloud-sdk" (460) from channel "stable"  82% 22.6MB/s 3.00s
Download snap "google-cloud-sdk" (460) from channel "stable"  83% 22.7MB/s 2.86s
Download snap "google-cloud-sdk" (460) from channel "stable"  83% 22.7MB/s 2.76s
Download snap "google-cloud-sdk" (460) from channel "stable"  84% 22.7MB/s 2.62s
Download snap "google-cloud-sdk" (460) from channel "stable"  85% 22.7MB/s 2.52s
Download snap "google-cloud-sdk" (460) from channel "stable"  85% 22.7MB/s 2.42s
Download snap "google-cloud-sdk" (460) from channel "stable"  86% 22.7MB/s 2.32s
Download snap "google-cloud-sdk" (460) from channel "stable"  86% 22.7MB/s 2.22s
Download snap "google-cloud-sdk" (460) from channel "stable"  87% 22.8MB/s 2.09s
Download snap "google-cloud-sdk" (460) from channel "stable"  87% 22.6MB/s 2.10s
Download snap "google-cloud-sdk" (460) from channel "stable"  87% 22.4MB/s 2.12s
Download snap "google-cloud-sdk" (460) from channel "stable"  87% 22.3MB/s 2.13s
Download snap "google-cloud-sdk" (460) from channel "stable"  87% 22.2MB/s 2.11s
Download snap "google-cloud-sdk" (460) from channel "stable"  88% 22.1MB/s 2.08s
Download snap "google-cloud-sdk" (460) from channel "stable"  88% 21.9MB/s 2.10s
Download snap "google-cloud-sdk" (460) from channel "stable"  88% 21.9MB/s 2.03s
Download snap "google-cloud-sdk" (460) from channel "stable"  88% 21.8MB/s 2.01s
Download snap "google-cloud-sdk" (460) from channel "stable"  89% 21.7MB/s 1.94s
Download snap "google-cloud-sdk" (460) from channel "stable"  89% 21.7MB/s 1.88s
Download snap "google-cloud-sdk" (460) from channel "stable"  89% 21.6MB/s 1.81s
Download snap "google-cloud-sdk" (460) from channel "stable"  90% 21.6MB/s 1.75s
Download snap "google-cloud-sdk" (460) from channel "stable"  90% 21.6MB/s 1.68s
Download snap "google-cloud-sdk" (460) from channel "stable"  91% 21.5MB/s 1.61s
Download snap "google-cloud-sdk" (460) from channel "stable"  91% 21.5MB/s 1.55s
Download snap "google-cloud-sdk" (460) from channel "stable"  91% 21.4MB/s 1.48s
Download snap "google-cloud-sdk" (460) from channel "stable"  92% 21.4MB/s 1.37s
Download snap "google-cloud-sdk" (460) from channel "stable"  93% 21.4MB/s 1.27s
Download snap "google-cloud-sdk" (460) from channel "stable"  93% 21.5MB/s 1.13s
Download snap "google-cloud-sdk" (460) from channel "stable"  94% 21.5MB/s 1.02s
Download snap "google-cloud-sdk" (460) from channel "stable"  95% 21.5MB/s 879ms
Download snap "google-cloud-sdk" (460) from channel "stable"  95% 21.5MB/s 775ms
Download snap "google-cloud-sdk" (460) from channel "stable"  96% 21.5MB/s 670ms
Download snap "google-cloud-sdk" (460) from channel "stable"  97% 21.6MB/s 530ms
Download snap "google-cloud-sdk" (460) from channel "stable"  98% 21.6MB/s 425ms
Download snap "google-cloud-sdk" (460) from channel "stable"  98% 21.6MB/s 286ms
Download snap "google-cloud-sdk" (460) from channel "stable"  99% 21.7MB/s 146ms
Download snap "google-cloud-sdk" (460) from channel "stable" 100% 21.7MB/s  43ms
Download snap "google-cloud-sdk" (460) from channel "stable" 100% 21.6MB/s 0.0ns
Download snap "google-cloud-sdk" (460) from channel "stable" 100% 21.5MB/s 0.0ns
Download snap "google-cloud-sdk" (460) from channel "stable" 100% 21.4MB/s 0.0ns
Download snap "google-cloud-sdk" (460) from channel "stable" 100% 21.2MB/s 0.0ns
Download snap "google-cloud-sdk" (460) from channel "stable" 100% 21.1MB/s 0.0ns
Download snap "google-cloud-sdk" (460) from channel "stable" 100% 21.0MB/s 0.0ns
Download snap "google-cloud-sdk" (460) from channel "stable" 100% 20.9MB/s 0.0ns
Download snap "google-cloud-sdk" (460) from channel "stable" 100% 20.8MB/s 0.0ns
Download snap "google-cloud-sdk" (460) from channel "stable" 100% 20.6MB/s 0.0ns
Download snap "google-cloud-sdk" (460) from channel "stable" 100% 20.5MB/s 0.0ns
Download snap "google-cloud-sdk" (460) from channel "stable" 100% 20.4MB/s 0.0ns
Download snap "google-cloud-sdk" (460) from channel "stable" 100% 20.3MB/s 0.0ns
Download snap "google-cloud-sdk" (460) from channel "stable" 100% 20.2MB/s 0.0ns
Download snap "google-cloud-sdk" (460) from channel "stable" 100% 20.1MB/s 0.0ns
Fetch and check assertions for snap "google-cloud-sdk" (460)                   \
Fetch and check assertions for snap "google-cloud-sdk" (460)                   |
Fetch and check assertions for snap "google-cloud-sdk" (460)                   /
Fetch and check assertions for snap "google-cloud-sdk" (460)                   -
Fetch and check assertions for snap "google-cloud-sdk" (460)                   \
Fetch and check assertions for snap "google-cloud-sdk" (460)                   |
Fetch and check assertions for snap "google-cloud-sdk" (460)                   /
Fetch and check assertions for snap "google-cloud-sdk" (460)                   -
Fetch and check assertions for snap "google-cloud-sdk" (460)                   \
Mount snap "google-cloud-sdk" (460)                                            |
Mount snap "google-cloud-sdk" (460)                                            /
Mount snap "google-cloud-sdk" (460)                                            -
Mount snap "google-cloud-sdk" (460)                                            \
Mount snap "google-cloud-sdk" (460)                                            |
Mount snap "google-cloud-sdk" (460)                                            /
Mount snap "google-cloud-sdk" (460)                                            -
Mount snap "google-cloud-sdk" (460)                                            \
Mount snap "google-cloud-sdk" (460)                                            |
Mount snap "google-cloud-sdk" (460)                                            /
Mount snap "google-cloud-sdk" (460)                                            -
Mount snap "google-cloud-sdk" (460)                                            \
Mount snap "google-cloud-sdk" (460)                                            |
Mount snap "google-cloud-sdk" (460)                                            /
Mount snap "google-cloud-sdk" (460)                                            -
Mount snap "google-cloud-sdk" (460)                                            \
Mount snap "google-cloud-sdk" (460)                                            |
Mount snap "google-cloud-sdk" (460)                                            /
Mount snap "google-cloud-sdk" (460)                                            -
Mount snap "google-cloud-sdk" (460)                                            \
Mount snap "google-cloud-sdk" (460)                                            |
[?25hgoogle-cloud-sdk 481.0.0 from Cloud SDK (google-cloud-sdk**) installed
travis_time:end:1b96b021:start=1718877872427919942,finish=1718877904198113868,duration=31770193926,event=prepare
travis_time:start:1d6a023a
$ sudo snap install vault

Ensure prerequisites for "vault" are available                                 /
Ensure prerequisites for "vault" are available                                 -
Ensure prerequisites for "vault" are available                                 \
Download snap "core22" (1380) from channel "stable"                            |
Download snap "core22" (1380) from channel "stable"                            /
Download snap "core22" (1380) from channel "stable"                            -
Download snap "core22" (1380) from channel "stable"                            \
Download snap "core22" (1380) from channel "stable"                            |
Download snap "core22" (1380) from channel "stable"                            /[?25l
Download snap "core22" (1380) from channel "stable"            1% 4.82MB/s 16.1s
Download snap "core22" (1380) from channel "stable"            4% 15.3MB/s 4.90s
Download snap "core22" (1380) from channel "stable"           16% 39.1MB/s 1.68s
Download snap "core22" (1380) from channel "stable"           28% 52.4MB/s 1.07s
Download snap "core22" (1380) from channel "stable"           39% 58.2MB/s 822ms
Download snap "core22" (1380) from channel "stable"           52% 65.0MB/s 575ms
Download snap "core22" (1380) from channel "stable"           64% 67.9MB/s 416ms
Download snap "core22" (1380) from channel "stable"           77% 71.4MB/s 256ms
Download snap "core22" (1380) from channel "stable"           88% 73.2MB/s 127ms
Download snap "core22" (1380) from channel "stable"          100% 74.4MB/s 0.0ns
Download snap "core22" (1380) from channel "stable"          100% 67.9MB/s 0.0ns
Download snap "core22" (1380) from channel "stable"          100% 62.4MB/s 0.0ns
Fetch and check assertions for snap "core22" (1380)                            -
Fetch and check assertions for snap "core22" (1380)                            \
Fetch and check assertions for snap "core22" (1380)                            |
Fetch and check assertions for snap "core22" (1380)                            /
Mount snap "core22" (1380)                                                     -
Mount snap "core22" (1380)                                                     \
Mount snap "core22" (1380)                                                     |
Mount snap "core22" (1380)                                                     /
Mount snap "core22" (1380)                                                     -
Mount snap "core22" (1380)                                                     \
Set automatic aliases for snap "core22"                                        |
Download snap "vault" (2275) from channel "1.16/stable"                        /
Download snap "vault" (2275) from channel "1.16/stable"                        -
Download snap "vault" (2275) from channel "1.16/stable"                        \
Download snap "vault" (2275) from channel "1.16/stable"                        |
Download snap "vault" (2275) from channel "1.16/stable"                        /
Download snap "vault" (2275) from channel "1.16/stable"                        -[?25l
Download snap "vault" (2275) from channel "1.16/stable"        0% 4.01MB/s 48.7s
Download snap "vault" (2275) from channel "1.16/stable"        1% 12.1MB/s 16.0s
Download snap "vault" (2275) from channel "1.16/stable"        5% 30.9MB/s 6.05s
Download snap "vault" (2275) from channel "1.16/stable"        9% 41.2MB/s 4.35s
Download snap "vault" (2275) from channel "1.16/stable"       12% 47.3MB/s 3.63s
Download snap "vault" (2275) from channel "1.16/stable"       16% 50.8MB/s 3.24s
Download snap "vault" (2275) from channel "1.16/stable"       20% 53.5MB/s 2.94s
Download snap "vault" (2275) from channel "1.16/stable"       23% 55.3MB/s 2.72s
Download snap "vault" (2275) from channel "1.16/stable"       28% 57.9MB/s 2.45s
Download snap "vault" (2275) from channel "1.16/stable"       31% 58.8MB/s 2.29s
Download snap "vault" (2275) from channel "1.16/stable"       35% 59.7MB/s 2.14s
Download snap "vault" (2275) from channel "1.16/stable"       38% 60.4MB/s 2.00s
Download snap "vault" (2275) from channel "1.16/stable"       42% 61.0MB/s 1.87s
Download snap "vault" (2275) from channel "1.16/stable"       46% 62.0MB/s 1.71s
Download snap "vault" (2275) from channel "1.16/stable"       50% 62.4MB/s 1.58s
Download snap "vault" (2275) from channel "1.16/stable"       53% 62.6MB/s 1.48s
Download snap "vault" (2275) from channel "1.16/stable"       57% 63.1MB/s 1.35s
Download snap "vault" (2275) from channel "1.16/stable"       60% 63.5MB/s 1.22s
Download snap "vault" (2275) from channel "1.16/stable"       64% 64.0MB/s 1.10s
Download snap "vault" (2275) from channel "1.16/stable"       68% 64.2MB/s 987ms
Download snap "vault" (2275) from channel "1.16/stable"       71% 64.2MB/s 885ms
Download snap "vault" (2275) from channel "1.16/stable"       75% 64.5MB/s 767ms
Download snap "vault" (2275) from channel "1.16/stable"       78% 64.8MB/s 651ms
Download snap "vault" (2275) from channel "1.16/stable"       82% 65.1MB/s 535ms
Download snap "vault" (2275) from channel "1.16/stable"       86% 65.2MB/s 427ms
Download snap "vault" (2275) from channel "1.16/stable"       89% 65.2MB/s 327ms
Download snap "vault" (2275) from channel "1.16/stable"       93% 65.5MB/s 214ms
Download snap "vault" (2275) from channel "1.16/stable"       97% 65.7MB/s  95ms
Download snap "vault" (2275) from channel "1.16/stable"      100% 65.6MB/s 0.0ns
Download snap "vault" (2275) from channel "1.16/stable"      100% 63.4MB/s 0.0ns
Download snap "vault" (2275) from channel "1.16/stable"      100% 61.4MB/s 0.0ns
Download snap "vault" (2275) from channel "1.16/stable"      100% 59.5MB/s 0.0ns
Download snap "vault" (2275) from channel "1.16/stable"      100% 57.8MB/s 0.0ns
Download snap "vault" (2275) from channel "1.16/stable"      100% 56.1MB/s 0.0ns
Download snap "vault" (2275) from channel "1.16/stable"      100% 54.5MB/s 0.0ns
Fetch and check assertions for snap "vault" (2275)                             \
Fetch and check assertions for snap "vault" (2275)                             |
Fetch and check assertions for snap "vault" (2275)                             /
Fetch and check assertions for snap "vault" (2275)                             -
Fetch and check assertions for snap "vault" (2275)                             \
Fetch and check assertions for snap "vault" (2275)                             |
Fetch and check assertions for snap "vault" (2275)                             /
Mount snap "vault" (2275)                                                      -
Setup snap "vault" (2275) security profiles for auto-connections               \
Run install hook of "vault" snap if present                                    |
Run install hook of "vault" snap if present                                    /
Run install hook of "vault" snap if present                                    -
Run install hook of "vault" snap if present                                    \
Run install hook of "vault" snap if present                                    |
[?25hvault (1.16/stable) 1.16.2 from Canonical** installed
travis_time:end:1d6a023a:start=1718877904205588399,finish=1718877915351641386,duration=11146052987,event=prepare
travis_time:start:2a4d7000
$ sudo snap list
Name              Version    Rev    Tracking       Publisher           Notes
core              16-2.61.2  16928  latest/stable  canonical**         core
core20            20240416   2318   latest/stable  canonical**         base
core22            20240408   1380   latest/stable  canonical**         base
google-cloud-sdk  481.0.0    460    latest/stable  google-cloud-sdk**  classic
vault             1.16.2     2275   1.16/stable    canonical**         -
travis_time:end:2a4d7000:start=1718877915357520535,finish=1718877915402162231,duration=44641696,event=prepare
travis_fold:end:snap

travis_time:start:134fffd2
travis_fold:start:services
travis_time:start:066f77c2
$ sudo systemctl start rabbitmq-server
Failed to start rabbitmq-server.service: Unit rabbitmq-server.service not found.
travis_time:end:066f77c2:start=1718877915418330943,finish=1718877915433645912,duration=15314969,event=prepare
travis_time:start:003a61d0
$ sudo systemctl start docker
travis_time:end:003a61d0:start=1718877915438862271,finish=1718877915452229156,duration=13366885,event=prepare
travis_time:start:2d6f24a8
$ sudo systemctl start redis-server
travis_time:end:2d6f24a8:start=1718877915459244908,finish=1718877915540237508,duration=80992600,event=prepare
travis_fold:end:services
travis_time:end:2d6f24a8:start=1718877915459244908,finish=1718877918546064391,duration=3086819483,event=services
travis_time:start:2fde2158
travis_time:end:2fde2158:start=1718877918551690032,finish=1718877918554126309,duration=2436277,event=fix_ps4
Updating gimme
travis_time:start:0ff2ca84

travis_fold:start:git.checkout
travis_time:start:1565bbfc
travis_time:end:1565bbfc:start=1718877924076419530,finish=1718877924083373755,duration=6954225,event=checkout
travis_time:start:054f30b8
$ git clone --depth=10 --branch=kw-updated_worker https://github.com/travis-ci/worker.git travis-ci/worker
Cloning into 'travis-ci/worker'...
travis_time:end:054f30b8:start=1718877924091714396,finish=1718877924721385471,duration=629671075,event=checkout
$ cd travis-ci/worker
$ git checkout -qf 64eeb70d7e94236d72fdf2b02bc27a9b25720c87
travis_fold:end:git.checkout

travis_time:end:054f30b8:start=1718877924091714396,finish=1718877924742959289,duration=651244893,event=checkout
$ travis_export_go 1.18.x github.com/travis-ci/worker
travis_time:start:17fed1b4

Setting environment variables from repository settings
$ export ARTIFACTS_PATHS=./build
$ export ARTIFACTS_BUCKET=travis-worker-artifacts
$ export ARTIFACTS_PERMISSIONS=public-read
$ export ARTIFACTS_KEY=[secure]
$ export ARTIFACTS_SECRET=[secure]
$ export PACKAGECLOUD_TOKEN=[secure]
$ export DOCKER_HUB_TRIGGER_URL=[secure]
$ export DOCKER_LOGIN_USERNAME=[secure]
$ export DOCKER_LOGIN_PASSWORD=[secure]
$ export VAULT_PASS=[secure]
$ export GCE_PROJECT=[secure]
$ export VAULT_USERNAME=[secure]
$ export VAULT_ADDR=[secure]
$ export CLOUDSDK_CORE_DISABLE_PROMPTS=[secure]

Setting environment variables from .travis.yml
$ export AMQP_URI="amqp://"
$ export GOPATH="$HOME/gopath"
$ export PATH="bin:$HOME/gopath/bin:$HOME/bin:$PATH"
$ export CHECKOUT_ROOT="$HOME/gopath/src/github.com/travis-ci/worker"
$ export GO15VENDOREXPERIMENT='1'
$ export REDIS_URL="redis://"

travis_time:end:17fed1b4:start=1718877924754800701,finish=1718877924770408081,duration=15607380,event=env
travis_time:start:095918ba
$ travis_setup_go
go version go1.18.10 linux/amd64
$ export GOPATH="/home/travis/gopath"
$ export PATH="/home/travis/gopath/bin:/home/travis/.gimme/versions/go1.18.10.linux.amd64/bin:bin:/home/travis/gopath/bin:/home/travis/bin:/home/travis/bin:/home/travis/bin:/home/travis/.local/bin:/usr/local/lib/jvm/openjdk11/bin:/opt/pyenv/shims:/home/travis/.phpenv/shims:/home/travis/perl5/perlbrew/bin:/home/travis/perl5/perlbrew/perls/5.34.1/bin:/home/travis/.nvm/versions/node/v16.16.0/bin:/home/travis/.rvm/gems/ruby-2.7.6/bin:/home/travis/.rvm/gems/ruby-2.7.6@global/bin:/home/travis/.rvm/rubies/ruby-2.7.6/bin:/home/travis/gopath/bin:/home/travis/.gimme/versions/go1.18.4.linux.amd64/bin:/usr/local/maven-3.8.8/bin:/usr/local/cmake-3.26.3/bin:/usr/local/clang-7.0.0/bin:/usr/local/sbin:/usr/local/bin:/usr/sbin:/usr/bin:/sbin:/bin:/snap/bin:/home/travis/.rvm/bin:/home/travis/.phpenv/bin:/opt/pyenv/bin:/home/travis/.yarn/bin"
$ export GO111MODULE="auto"
travis_time:end:095918ba:start=1718877924792680353,finish=1718877929286513825,duration=4493833472,event=
travis_fold:start:cache.1
Setting up build cache
$ export CASHER_DIR=${TRAVIS_HOME}/.casher
travis_time:start:03ce99a0
$ Installing caching utilities
travis_time:end:03ce99a0:start=1718877930107829447,finish=1718877930373932623,duration=266103176,event=setup_casher
travis_time:start:1303d22d
travis_time:end:1303d22d:start=1718877930380085809,finish=1718877930384171770,duration=4085961,event=setup_casher
travis_time:start:04140b0a
attempting to download cache archive
fetching kw-updated_worker/cache--linux-xenial-8e66efc74188d5464db6c5a9d3decd4835ed340208a6ac39f04af14f2f93a35a--go-1.18.x.tgz
found cache
travis_time:end:04140b0a:start=1718877930389294343,finish=1718877932425479641,duration=2036185298,event=setup_casher
travis_time:start:006b65a0
travis_time:end:006b65a0:start=1718877932436874316,finish=1718877932439971820,duration=3097504,event=setup_casher
travis_time:start:01485fe8
adding /home/travis/gopath/src/github.com/travis-ci/worker/vendor to cache
creating directory /home/travis/gopath/src/github.com/travis-ci/worker/vendor
adding /home/travis/.cache/go-build to cache
adding /home/travis/gopath/bin to cache
adding /home/travis/gopath/pkg/mod to cache
creating directory /home/travis/gopath/pkg/mod
travis_time:end:01485fe8:start=1718877932445176329,finish=1718877941901969555,duration=9456793226,event=setup_casher
travis_fold:end:cache.1

$ gimme version
v1.5.4
$ go version
go version go1.18.10 linux/amd64
travis_fold:start:go.env
$ go env
GO111MODULE="auto"
GOARCH="amd64"
GOBIN=""
GOCACHE="/home/travis/.cache/go-build"
GOENV="/home/travis/.config/go/env"
GOEXE=""
GOEXPERIMENT=""
GOFLAGS=""
GOHOSTARCH="amd64"
GOHOSTOS="linux"
GOINSECURE=""
GOMODCACHE="/home/travis/gopath/pkg/mod"
GONOPROXY=""
GONOSUMDB=""
GOOS="linux"
GOPATH="/home/travis/gopath"
GOPRIVATE=""
GOPROXY="https://proxy.golang.org,direct"
GOROOT="/home/travis/.gimme/versions/go1.18.10.linux.amd64"
GOSUMDB="sum.golang.org"
GOTMPDIR=""
GOTOOLDIR="/home/travis/.gimme/versions/go1.18.10.linux.amd64/pkg/tool/linux_amd64"
GOVCS=""
GOVERSION="go1.18.10"
GCCGO="gccgo"
GOAMD64="v1"
AR="ar"
CC="gcc"
CXX="g++"
CGO_ENABLED="1"
GOMOD="/home/travis/gopath/src/github.com/travis-ci/worker/go.mod"
GOWORK=""
CGO_CFLAGS="-g -O2"
CGO_CPPFLAGS=""
CGO_CXXFLAGS="-g -O2"
CGO_FFLAGS="-g -O2"
CGO_LDFLAGS="-g -O2"
PKG_CONFIG="pkg-config"
GOGCCFLAGS="-fPIC -m64 -pthread -fmessage-length=0 -fdebug-prefix-map=/tmp/go-build3472483154=/tmp/go-build -gno-record-gcc-switches"
travis_fold:end:go.env
travis_fold:start:install
travis_time:start:01dfd1b3
$ travis_install_go_dependencies 1.18.x -v
Makefile detected
travis_time:end:01dfd1b3:start=1718877942108989780,finish=1718877942113986778,duration=4996998,event=install
travis_fold:end:install
travis_time:start:0322706a
$ vault login --no-print -method=userpass username=$VAULT_USERNAME password=$VAULT_PASS
travis_time:end:0322706a:start=1718877942119559543,finish=1718877945903160325,duration=3783600782,event=script
The command "vault login --no-print -method=userpass username=$VAULT_USERNAME password=$VAULT_PASS" exited with 0.
travis_time:start:2a5a5f46
$ vault kv get -field=secret gcp/[secure]-sa-key > /tmp/[secure]_key.json;
travis_time:end:2a5a5f46:start=1718877945910120924,finish=1718877946219178542,duration=309057618,event=script
The command "vault kv get -field=secret gcp/[secure]-sa-key > /tmp/[secure]_key.json;" exited with 0.
travis_time:start:067d5824
$ gcloud -q auth activate-service-account --key-file /tmp/[secure]_key.json;
Activated service account credentials for: [sa-docker-images@[secure].iam.gserviceaccount.com]
travis_time:end:067d5824:start=1718877946226693680,finish=1718877948148436841,duration=1921743161,event=script
The command "gcloud -q auth activate-service-account --key-file /tmp/[secure]_key.json;" exited with 0.
travis_time:start:07e41fe6
$ gcloud -q config set project ${GCE_PROJECT}
Updated property [core/project].
WARNING: You do not appear to have access to project [[secure]] or it does not exist.
travis_time:end:07e41fe6:start=1718877948162344566,finish=1718877949494073165,duration=1331728599,event=script
The command "gcloud -q config set project ${GCE_PROJECT}" exited with 0.
travis_time:start:02f72128
$ gcloud auth configure-docker
Adding credentials for all GCR repositories.
WARNING: A long list of credential helpers may cause delays running 'docker build'. We recommend passing the registry name to configure only the registry you are using.
Docker configuration file updated.
travis_time:end:02f72128:start=1718877949499550507,finish=1718877951004775137,duration=1505224630,event=script
The command "gcloud auth configure-docker" exited with 0.
travis_time:start:1e8196dc
$ make docker-build
docker build -t [secure].io/[secure]/worker:v6.2.24-8-g64eeb70 .
Sending build context to Docker daemon  54.39MB


Step 1/16 : FROM golang:1.21 as builder
1.21: Pulling from library/golang
fea1432adf09: Pulling fs layer
5651b5803b18: Pulling fs layer
3873416e6a33: Pulling fs layer
6efb595508de: Pulling fs layer
98b7747f5ef5: Pulling fs layer
1a74743e93e9: Pulling fs layer
4f4fb700ef54: Pulling fs layer
6efb595508de: Waiting
98b7747f5ef5: Waiting
1a74743e93e9: Waiting
4f4fb700ef54: Waiting
5651b5803b18: Verifying Checksum
5651b5803b18: Download complete
fea1432adf09: Verifying Checksum
fea1432adf09: Download complete
3873416e6a33: Verifying Checksum
3873416e6a33: Download complete
1a74743e93e9: Verifying Checksum
1a74743e93e9: Download complete
4f4fb700ef54: Verifying Checksum
4f4fb700ef54: Download complete
98b7747f5ef5: Verifying Checksum
98b7747f5ef5: Download complete
6efb595508de: Verifying Checksum
6efb595508de: Download complete
fea1432adf09: Pull complete
5651b5803b18: Pull complete
3873416e6a33: Pull complete
6efb595508de: Pull complete
98b7747f5ef5: Pull complete
1a74743e93e9: Pull complete
4f4fb700ef54: Pull complete
Digest: sha256:2eb85b8942c29145b4a5bed2d0f3dc1a3ba2f823aec74afe16751da108a585e1
Status: Downloaded newer image for golang:1.21
 ---> 4b088a6b9b88
Step 2/16 : MAINTAINER Travis CI GmbH <support+travis-worker-docker-image@travis-ci.org>
 ---> Running in e8848df2dae5
Removing intermediate container e8848df2dae5
 ---> 0ac940d3cdb5
Step 3/16 : COPY . /go/src/github.com/travis-ci/worker
 ---> 1ffee333153f
Step 4/16 : WORKDIR /go/src/github.com/travis-ci/worker
 ---> Running in 802a5a23a88a
Removing intermediate container 802a5a23a88a
 ---> cc47c50f0d86
Step 5/16 : ENV CGO_ENABLED 0
 ---> Running in 5f3eb4ebff50
Removing intermediate container 5f3eb4ebff50
 ---> d9b116e20d9f
Step 6/16 : RUN make build
 ---> Running in 0a16212d6b0c
GO111MODULE=on go mod download
make: bash: Operation not permitted
make: bash: Operation not permitted
make: bash: Operation not permitted
make: bash: Operation not permitted
make: bash: Operation not permitted
make: *** [Makefile:104: .deps-fetched] Error 127
The command '/bin/sh -c make build' returned a non-zero code: 2
Makefile:84: recipe for target 'docker-build' failed
make: *** [docker-build] Error 2
travis_time:end:1e8196dc:start=1718877951012195556,finish=1718877979962770407,duration=28950574851,event=script
The command "make docker-build" exited with 2.
travis_time:start:112b75f8
$ make docker-push
./script/docker-push
time=2024-06-20T10:06:20Z msg="docker login"
WARNING! Your password will be stored unencrypted in /home/travis/.docker/config.json.
Configure a credential helper to remove this warning. See
https://docs.docker.com/engine/reference/commandline/login/#credentials-store

Login Succeeded
time=2024-06-20T10:06:20Z msg="docker push" dest=[secure].io/[secure]/worker:v6.2.24-8-g64eeb70 attempt=1
The push refers to repository [[secure].io/[secure]/worker]
An image does not exist locally with the tag: [secure].io/[secure]/worker
time=2024-06-20T10:06:21Z msg="sleeping" interval=10
time=2024-06-20T10:06:31Z msg="docker push" dest=[secure].io/[secure]/worker:v6.2.24-8-g64eeb70 attempt=2
The push refers to repository [[secure].io/[secure]/worker]
An image does not exist locally with the tag: [secure].io/[secure]/worker
time=2024-06-20T10:06:31Z msg="sleeping" interval=20
time=2024-06-20T10:06:51Z msg="docker push" dest=[secure].io/[secure]/worker:v6.2.24-8-g64eeb70 attempt=3
The push refers to repository [[secure].io/[secure]/worker]
An image does not exist locally with the tag: [secure].io/[secure]/worker
time=2024-06-20T10:06:52Z msg="sleeping" interval=30
time=2024-06-20T10:07:22Z msg="docker push" dest=[secure].io/[secure]/worker:v6.2.24-8-g64eeb70 attempt=4
The push refers to repository [[secure].io/[secure]/worker]
An image does not exist locally with the tag: [secure].io/[secure]/worker
time=2024-06-20T10:07:22Z msg="sleeping" interval=40
time=2024-06-20T10:08:02Z msg="docker push" dest=[secure].io/[secure]/worker:v6.2.24-8-g64eeb70 attempt=5
The push refers to repository [[secure].io/[secure]/worker]
An image does not exist locally with the tag: [secure].io/[secure]/worker
time=2024-06-20T10:08:03Z msg="sleeping" interval=50
time=2024-06-20T10:08:53Z msg="docker push" dest=[secure].io/[secure]/worker:v6.2.24-8-g64eeb70 attempt=6
The push refers to repository [[secure].io/[secure]/worker]
An image does not exist locally with the tag: [secure].io/[secure]/worker
time=2024-06-20T10:08:54Z msg="sleeping" interval=60
time=2024-06-20T10:09:54Z msg="docker push" dest=[secure].io/[secure]/worker:v6.2.24-8-g64eeb70 attempt=7
The push refers to repository [[secure].io/[secure]/worker]
An image does not exist locally with the tag: [secure].io/[secure]/worker
Makefile:53: recipe for target 'docker-push' failed
make: *** [docker-push] Error 86
travis_time:end:112b75f8:start=1718877979971855102,finish=1718878194757388448,duration=214785533346,event=script
The command "make docker-push" exited with 2.
travis_fold:start:before_cache
travis_time:start:1cfda766
$ make clean
./script/clean
travis_time:end:1cfda766:start=1718878194764468845,finish=1718878194885330057,duration=120861212,event=before_cache
travis_fold:end:before_cache
travis_fold:start:cache.2
store build cache
travis_time:start:0363896a
travis_time:end:0363896a:start=1718878194891324377,finish=1718878194895182685,duration=3858308,event=cache
travis_time:start:00cd5d2c
nothing changed
travis_time:end:00cd5d2c:start=1718878194902102386,finish=1718878197933761405,duration=3031659019,event=cache
travis_fold:end:cache.2


Done. Your build exited with 1.