travis_fold:start:worker_info
Worker information
hostname: b22c40dd-de2d-4f45-ba8c-4dc4314f7623@1.worker-n2-com-779d777f7b-twnw9.gce-production-1
version: 6.2.22 https://github.com/travis-ci/worker/tree/858cb91994a513269f2fe9782c15fc113e966231
instance: travis-job-aa554f8d-e6ff-4909-952c-634e69f59432 travis-ci-sardonyx-xenial-1684402799-0876f6f0 (via amqp)
startup: 6.098971812s
travis_fold:end:worker_info
travis_time:start:282638df
travis_time:end:282638df:start=1718806106626933815,finish=1718806106773094119,duration=146160304,event=no_world_writable_dirs
travis_time:start:03f5013b
travis_time:end:03f5013b:start=1718806106775758142,finish=1718806106778716525,duration=2958383,event=setup_filter
travis_time:start:10b39a95
travis_time:end:10b39a95:start=1718806106783878561,finish=1718806106791545151,duration=7666590,event=agent
travis_time:start:21f77a00
travis_time:end:21f77a00:start=1718806106794393118,finish=1718806106796426717,duration=2033599,event=check_unsupported
travis_time:start:14dd5ef4
travis_fold:start:system_info
Build system information
Build language: go
Build dist: xenial
Build id: 271035725
Job id: 623120924
Runtime kernel version: 4.15.0-1098-gcp
travis-build version: 3484ecfe
Build image provisioning date and time
Thu May 18 10:07:51 UTC 2023
Operating System Details
Distributor ID:	Ubuntu
Description:	Ubuntu 16.04.7 LTS
Release:	16.04
Codename:	xenial
Systemd Version
systemd 229
Cookbooks Version
d19e5ff https://github.com/travis-ci/travis-cookbooks/tree/d19e5ff
git version
git version 2.40.1
bash version
GNU bash, version 4.3.48(1)-release (x86_64-pc-linux-gnu)
gcc version
gcc (Ubuntu 5.4.0-6ubuntu1~16.04.12) 5.4.0 20160609
docker version
Client: Docker Engine - Community
 Version:           20.10.7
 API version:       1.41
 Go version:        go1.13.15
 Git commit:        f0df350
 Built:             Wed Jun  2 11:56:47 2021
 OS/Arch:           linux/amd64
 Context:           default
 Experimental:      true

Server: Docker Engine - Community
 Engine:
  Version:          20.10.7
  API version:      1.41 (minimum version 1.12)
  Go version:       go1.13.15
  Git commit:       b0f5bc3
  Built:            Wed Jun  2 11:54:58 2021
  OS/Arch:          linux/amd64
  Experimental:     false
 containerd:
  Version:          1.4.6
  GitCommit:        d71fcd7d8303cbf684402823e425e9dd2e99285d
 runc:
  Version:          1.0.0-rc95
  GitCommit:        b9ee9c6314599f1b4a7f497e1f1f856fe433d3b7
 docker-init:
  Version:          0.19.0
  GitCommit:        de40ad0
clang version
clang version 7.0.0 (tags/RELEASE_700/final)
jq version
jq-1.6
bats version
Bats 0.4.0
shellcheck version
0.7.2
shfmt version
v3.2.1
ccache version
3.2.4
cmake version
cmake version 3.26.3
heroku version
heroku/8.1.3 linux-x64 node-v16.19.0
imagemagick version
Version: ImageMagick 6.8.9-9 Q16 x86_64 2020-12-04 http://www.imagemagick.org
md5deep version
4.4
mercurial version
version 5.9.3
mysql version
mysql  Ver 14.14 Distrib 5.7.33, for Linux (x86_64) using  EditLine wrapper
openssl version
OpenSSL 1.0.2g  1 Mar 2016
packer version
1.7.5
postgresql client version
psql (PostgreSQL) 10.17 (Ubuntu 10.17-1.pgdg16.04+1)
ragel version
Ragel State Machine Compiler version 6.8 Feb 2013
sudo version
1.8.16
gzip version
gzip 1.6
zip version
Zip 3.0
vim version
VIM - Vi IMproved 7.4 (2013 Aug 10, compiled Oct 13 2020 16:04:38)
iptables version
iptables v1.6.0
curl version
curl 7.47.0 (x86_64-pc-linux-gnu) libcurl/7.47.0 GnuTLS/3.4.10 zlib/1.2.8 libidn/1.32 librtmp/2.3
wget version
GNU Wget 1.17.1 built on linux-gnu.
rsync version
rsync  version 3.1.1  protocol version 31
gimme version
v1.5.4
nvm version
0.39.3
perlbrew version
/home/travis/perl5/perlbrew/bin/perlbrew  - App::perlbrew/0.95
phpenv version
rbenv 1.2.0
rvm version
rvm 1.29.12 (latest) by Michal Papis, Piotr Kuczynski, Wayne E. Seguin [https://rvm.io]
default ruby version
ruby 2.7.6p219 (2022-04-12 revision c9c2245c0a) [x86_64-linux]
default python version
Python 3.7.13
CouchDB version
couchdb 1.6.1
ElasticSearch version
7.16.3
Installed Firefox version
firefox 63.0.1
MongoDB version
MongoDB 4.4.21
PhantomJS version
2.1.1
Pre-installed PostgreSQL versions
9.4.26
9.5.25
9.6.22
Redis version
redis-server 6.0.6
Pre-installed Go versions
1.18.4
ant version
Apache Ant(TM) version 1.9.6 compiled on July 20 2018
mvn version
Apache Maven 3.8.8 (4c87b05d9aedce574290d1acc98575ed5eb6cd39)
gradle version
Gradle 7.5.1!
lein version
Leiningen 2.10.0 on Java 11.0.15.1 OpenJDK 64-Bit Server VM
Pre-installed Node.js versions
v10.24.1
v12.22.12
v14.21.3
v16.15
v16.16.0
v16.20.0
v18.16.0
v4.9.1
v6.17.1
v8.17.0
phpenv versions
  system
  7.4
* 7.4.30 (set by /home/travis/.phpenv/version)
  hhvm-stable
  hhvm
composer --version
Composer version 2.3.7 2022-06-06 16:43:28
Pre-installed Ruby versions
ruby-2.7.6
ruby-3.0.4
ruby-3.1.2
travis_fold:end:system_info

travis_time:end:14dd5ef4:start=1718806106799057324,finish=1718806106806665574,duration=7608250,event=show_system_info
travis_time:start:135c89a6
travis_time:end:135c89a6:start=1718806106809538490,finish=1718806106821794695,duration=12256205,event=rm_riak_source
travis_time:start:03c8d3fb
travis_time:end:03c8d3fb:start=1718806106824502340,finish=1718806106832090748,duration=7588408,event=fix_rwky_redis
travis_time:start:1124f004
travis_time:end:1124f004:start=1718806106835433338,finish=1718806107672136622,duration=836703284,event=wait_for_network
travis_time:start:007b11d9
travis_time:end:007b11d9:start=1718806107677455494,finish=1718806132761868377,duration=25084412883,event=update_apt_keys
travis_time:start:00075bf6
travis_time:end:00075bf6:start=1718806132768574590,finish=1718806132821495016,duration=52920426,event=fix_hhvm_source
travis_time:start:018ecbbe
travis_time:end:018ecbbe:start=1718806132826401648,finish=1718806132830089868,duration=3688220,event=update_mongo_arch
travis_time:start:1ab1dcb8
travis_time:end:1ab1dcb8:start=1718806132834854873,finish=1718806132875161922,duration=40307049,event=fix_sudo_enabled_trusty
travis_time:start:00959747
travis_time:end:00959747:start=1718806132880141890,finish=1718806132882495572,duration=2353682,event=update_glibc
travis_time:start:2c1cc2ac
travis_time:end:2c1cc2ac:start=1718806132887633445,finish=1718806132918851173,duration=31217728,event=clean_up_path
travis_time:start:3036ba6c
travis_time:end:3036ba6c:start=1718806132922584777,finish=1718806132931025399,duration=8440622,event=fix_resolv_conf
travis_time:start:2fce735e
travis_time:end:2fce735e:start=1718806132939792847,finish=1718806132949726153,duration=9933306,event=fix_etc_hosts
travis_time:start:1f0c52a4
travis_time:end:1f0c52a4:start=1718806132955111761,finish=1718806132963026184,duration=7914423,event=fix_mvn_settings_xml
travis_time:start:0263d71f
travis_time:end:0263d71f:start=1718806132967852286,finish=1718806132977031688,duration=9179402,event=no_ipv6_localhost
travis_time:start:0129116f
travis_time:end:0129116f:start=1718806132984821166,finish=1718806132988284683,duration=3463517,event=fix_etc_mavenrc
travis_time:start:10720435
OK
travis_time:end:10720435:start=1718806132995341874,finish=1718806133317841123,duration=322499249,event=fix_perforce_key
travis_time:start:2c2e9180
travis_time:end:2c2e9180:start=1718806133324269137,finish=1718806133328816930,duration=4547793,event=fix_wwdr_certificate
travis_time:start:032f62c0
travis_time:end:032f62c0:start=1718806133335471870,finish=1718806133360238334,duration=24766464,event=put_localhost_first
travis_time:start:004e7660
travis_time:end:004e7660:start=1718806133367789650,finish=1718806133370924189,duration=3134539,event=home_paths
travis_time:start:01258a5e
travis_time:end:01258a5e:start=1718806133374484633,finish=1718806133386261908,duration=11777275,event=disable_initramfs
travis_time:start:0095bc67
travis_time:end:0095bc67:start=1718806133391934319,finish=1718806133658743009,duration=266808690,event=disable_ssh_roaming
travis_time:start:0d837fe1
travis_time:end:0d837fe1:start=1718806133663723975,finish=1718806133666378063,duration=2654088,event=debug_tools
travis_time:start:0b64f54a
travis_time:end:0b64f54a:start=1718806133670979907,finish=1718806133674807133,duration=3827226,event=uninstall_oclint
travis_time:start:01b45774
travis_time:end:01b45774:start=1718806133679920512,finish=1718806133683022829,duration=3102317,event=rvm_use
travis_time:start:1dc1866e
travis_time:end:1dc1866e:start=1718806133688561942,finish=1718806133696571614,duration=8009672,event=rm_etc_boto_cfg
travis_time:start:0d4aad08
travis_time:end:0d4aad08:start=1718806133704624814,finish=1718806133707829017,duration=3204203,event=rm_oraclejdk8_symlink
travis_time:start:0a967148
travis_time:end:0a967148:start=1718806133713143873,finish=1718806133799853362,duration=86709489,event=enable_i386
travis_time:start:01bdba53
travis_time:end:01bdba53:start=1718806133809531724,finish=1718806133813429896,duration=3898172,event=update_rubygems
travis_time:start:1bdac3cc
travis_time:end:1bdac3cc:start=1718806133821944790,finish=1718806134653215269,duration=831270479,event=ensure_path_components
travis_time:start:0d539af8
travis_time:end:0d539af8:start=1718806134661901264,finish=1718806134665546416,duration=3645152,event=redefine_curl
travis_time:start:25a5fc5e
travis_time:end:25a5fc5e:start=1718806134674615431,finish=1718806134781140548,duration=106525117,event=nonblock_pipe
travis_time:start:15a57273
travis_time:end:15a57273:start=1718806134785545154,finish=1718806148856179199,duration=14070634045,event=apt_get_update
travis_time:start:0912a61a
travis_time:end:0912a61a:start=1718806148863891099,finish=1718806148866502726,duration=2611627,event=deprecate_xcode_64
travis_time:start:1225dee8
travis_time:end:1225dee8:start=1718806148874048611,finish=1718806152335066396,duration=3461017785,event=update_heroku
travis_time:start:098f1330
travis_time:end:098f1330:start=1718806152339793889,finish=1718806152343139697,duration=3345808,event=shell_session_update
travis_time:start:2e85a540
travis_fold:start:docker_mtu_and_registry_mirrors
travis_fold:end:docker_mtu_and_registry_mirrors
travis_time:end:2e85a540:start=1718806152348404769,finish=1718806155858398792,duration=3509994023,event=set_docker_mtu_and_registry_mirrors
travis_time:start:054532ac
travis_fold:start:resolvconf
travis_fold:end:resolvconf
travis_time:end:054532ac:start=1718806155863803630,finish=1718806155922876375,duration=59072745,event=resolvconf
travis_time:start:298c3f24
travis_time:end:298c3f24:start=1718806155927569582,finish=1718806156048555405,duration=120985823,event=maven_central_mirror
travis_time:start:0871f3e0
travis_time:end:0871f3e0:start=1718806156055725045,finish=1718806156141975685,duration=86250640,event=maven_https
travis_fold:start:apt
travis_time:start:086a6e66
$ travis_apt_get_update
travis_time:end:086a6e66:start=1718806156152229230,finish=1718806162619033506,duration=6466804276,event=prepare
Installing APT Packages
travis_time:start:079b6816
$ sudo -E apt-get -yq --no-install-suggests --no-install-recommends $(travis_apt_get_options) install docker-ce
Reading package lists...
Building dependency tree...
Reading state information...
docker-ce is already the newest version (5:20.10.7~3-0~ubuntu-xenial).
0 upgraded, 0 newly installed, 0 to remove and 23 not upgraded.
travis_time:end:079b6816:start=1718806162624534653,finish=1718806163122905024,duration=498370371,event=prepare
travis_fold:end:apt

travis_fold:start:snap
Installing 2 Snaps
travis_time:start:0ce1ccb8
$ sudo snap install core

Download snap "core" (16928) from channel "stable"                             /
Download snap "core" (16928) from channel "stable"                             -
Download snap "core" (16928) from channel "stable"                             \
Download snap "core" (16928) from channel "stable"                             |
Download snap "core" (16928) from channel "stable"                             /
Download snap "core" (16928) from channel "stable"                             -
Download snap "core" (16928) from channel "stable"                             \[?25l
Download snap "core" (16928) from channel "stable"             0%     0B/s ages!
Download snap "core" (16928) from channel "stable"             1% 3.39MB/s 32.0s
Download snap "core" (16928) from channel "stable"             5% 16.6MB/s 6.27s
Download snap "core" (16928) from channel "stable"            11% 28.8MB/s 3.38s
Download snap "core" (16928) from channel "stable"            17% 37.1MB/s 2.44s
Download snap "core" (16928) from channel "stable"            25% 44.1MB/s 1.87s
Download snap "core" (16928) from channel "stable"            30% 46.8MB/s 1.62s
Download snap "core" (16928) from channel "stable"            37% 50.0MB/s 1.37s
Download snap "core" (16928) from channel "stable"            44% 53.3MB/s 1.14s
Download snap "core" (16928) from channel "stable"            50% 54.5MB/s 991ms
Download snap "core" (16928) from channel "stable"            57% 56.1MB/s 832ms
Download snap "core" (16928) from channel "stable"            64% 57.7MB/s 679ms
Download snap "core" (16928) from channel "stable"            70% 58.4MB/s 552ms
Download snap "core" (16928) from channel "stable"            77% 59.6MB/s 415ms
Download snap "core" (16928) from channel "stable"            84% 60.5MB/s 288ms
Download snap "core" (16928) from channel "stable"            90% 60.9MB/s 174ms
Download snap "core" (16928) from channel "stable"            97% 61.9MB/s  45ms
Download snap "core" (16928) from channel "stable"           100% 60.0MB/s 0.0ns
Download snap "core" (16928) from channel "stable"           100% 56.8MB/s 0.0ns
Download snap "core" (16928) from channel "stable"           100% 54.0MB/s 0.0ns
Fetch and check assertions for snap "core" (16928)                             |
Fetch and check assertions for snap "core" (16928)                             /
Fetch and check assertions for snap "core" (16928)                             -
Fetch and check assertions for snap "core" (16928)                             \
Fetch and check assertions for snap "core" (16928)                             |
Fetch and check assertions for snap "core" (16928)                             /
Fetch and check assertions for snap "core" (16928)                             -
Mount snap "core" (16928)                                                      \
Mount snap "core" (16928)                                                      |
Mount snap "core" (16928)                                                      /
Mount snap "core" (16928)                                                      -
Mount snap "core" (16928)                                                      \
Mount snap "core" (16928)                                                      |
Mount snap "core" (16928)                                                      /
Setup snap "core" (16928) security profiles                                    -
Setup snap "core" (16928) security profiles                                    \
Automatically connect eligible plugs and slots of snap "core"                  |
2024-06-19T14:09:30Z INFO Waiting for automatic snapd restart...

Automatically connect eligible plugs and slots of snap "core"                  /
Run health check of "core" snap                                                -
[?25hcore 16-2.61.2 from Canonical* installed
travis_time:end:0ce1ccb8:start=1718806163128728066,finish=1718806172122226367,duration=8993498301,event=prepare
travis_time:start:00734a29
$ sudo snap install google-cloud-sdk --classic

Ensure prerequisites for "google-cloud-sdk" are available                      /
Ensure prerequisites for "google-cloud-sdk" are available                      -
Ensure prerequisites for "google-cloud-sdk" are available                      \
Download snap "core20" (2318) from channel "stable"                            |
Download snap "core20" (2318) from channel "stable"                            /
Download snap "core20" (2318) from channel "stable"                            -
Download snap "core20" (2318) from channel "stable"                            \
Download snap "core20" (2318) from channel "stable"                            |
Download snap "core20" (2318) from channel "stable"                            /
Download snap "core20" (2318) from channel "stable"                            -
Download snap "core20" (2318) from channel "stable"                            \[?25l
Download snap "core20" (2318) from channel "stable"            1% 4.34MB/s 15.4s
Download snap "core20" (2318) from channel "stable"            4% 12.3MB/s 5.24s
Download snap "core20" (2318) from channel "stable"           14% 30.5MB/s 1.90s
Download snap "core20" (2318) from channel "stable"           25% 40.6MB/s 1.25s
Download snap "core20" (2318) from channel "stable"           35% 45.8MB/s 957ms
Download snap "core20" (2318) from channel "stable"           45% 49.2MB/s 754ms
Download snap "core20" (2318) from channel "stable"           55% 52.1MB/s 577ms
Download snap "core20" (2318) from channel "stable"           67% 55.1MB/s 399ms
Download snap "core20" (2318) from channel "stable"           77% 56.2MB/s 270ms
Download snap "core20" (2318) from channel "stable"           88% 57.6MB/s 142ms
Download snap "core20" (2318) from channel "stable"           99% 58.6MB/s  14ms
Download snap "core20" (2318) from channel "stable"          100% 54.4MB/s 0.0ns
Fetch and check assertions for snap "core20" (2318)                            |
Fetch and check assertions for snap "core20" (2318)                            /
Fetch and check assertions for snap "core20" (2318)                            -
Fetch and check assertions for snap "core20" (2318)                            \
Mount snap "core20" (2318)                                                     |
Mount snap "core20" (2318)                                                     /
Mount snap "core20" (2318)                                                     -
Mount snap "core20" (2318)                                                     \
Mount snap "core20" (2318)                                                     |
Mount snap "core20" (2318)                                                     /
Download snap "google-cloud-sdk" (460) from channel "stable"                   -
Download snap "google-cloud-sdk" (460) from channel "stable"                   \
Download snap "google-cloud-sdk" (460) from channel "stable"                   |
Download snap "google-cloud-sdk" (460) from channel "stable"                   /
Download snap "google-cloud-sdk" (460) from channel "stable"                   -
Download snap "google-cloud-sdk" (460) from channel "stable"                   \
Download snap "google-cloud-sdk" (460) from channel "stable"                   |
Download snap "google-cloud-sdk" (460) from channel "stable"                   /[?25l
Download snap "google-cloud-sdk" (460) from channel "stable"   0%     0B/s ages!
Download snap "google-cloud-sdk" (460) from channel "stable"   0%     0B/s ages!
Download snap "google-cloud-sdk" (460) from channel "stable"   0%     0B/s ages!
Download snap "google-cloud-sdk" (460) from channel "stable"   0%     0B/s ages!
Download snap "google-cloud-sdk" (460) from channel "stable"   0%     0B/s ages!
Download snap "google-cloud-sdk" (460) from channel "stable"   0% 1.24MB/s 4m59s
Download snap "google-cloud-sdk" (460) from channel "stable"   1% 3.18MB/s 1m56s
Download snap "google-cloud-sdk" (460) from channel "stable"   1% 4.64MB/s 1m19s
Download snap "google-cloud-sdk" (460) from channel "stable"   2% 7.41MB/s 49.0s
Download snap "google-cloud-sdk" (460) from channel "stable"   2% 8.90MB/s 40.6s
Download snap "google-cloud-sdk" (460) from channel "stable"   3% 10.8MB/s 33.2s
Download snap "google-cloud-sdk" (460) from channel "stable"   4% 11.7MB/s 30.3s
Download snap "google-cloud-sdk" (460) from channel "stable"   4% 12.6MB/s 28.2s
Download snap "google-cloud-sdk" (460) from channel "stable"   5% 13.8MB/s 25.5s
Download snap "google-cloud-sdk" (460) from channel "stable"   6% 14.3MB/s 24.3s
Download snap "google-cloud-sdk" (460) from channel "stable"   7% 15.3MB/s 22.6s
Download snap "google-cloud-sdk" (460) from channel "stable"   8% 16.1MB/s 21.2s
Download snap "google-cloud-sdk" (460) from channel "stable"   8% 16.5MB/s 20.6s
Download snap "google-cloud-sdk" (460) from channel "stable"   9% 16.8MB/s 20.1s
Download snap "google-cloud-sdk" (460) from channel "stable"  10% 17.4MB/s 19.2s
Download snap "google-cloud-sdk" (460) from channel "stable"  10% 17.7MB/s 18.8s
Download snap "google-cloud-sdk" (460) from channel "stable"  11% 17.9MB/s 18.5s
Download snap "google-cloud-sdk" (460) from channel "stable"  12% 18.4MB/s 17.8s
Download snap "google-cloud-sdk" (460) from channel "stable"  12% 18.5MB/s 17.6s
Download snap "google-cloud-sdk" (460) from channel "stable"  13% 18.7MB/s 17.3s
Download snap "google-cloud-sdk" (460) from channel "stable"  14% 19.1MB/s 16.8s
Download snap "google-cloud-sdk" (460) from channel "stable"  14% 19.5MB/s 16.3s
Download snap "google-cloud-sdk" (460) from channel "stable"  15% 19.6MB/s 16.1s
Download snap "google-cloud-sdk" (460) from channel "stable"  16% 19.7MB/s 15.9s
Download snap "google-cloud-sdk" (460) from channel "stable"  16% 20.0MB/s 15.5s
Download snap "google-cloud-sdk" (460) from channel "stable"  17% 20.1MB/s 15.3s
Download snap "google-cloud-sdk" (460) from channel "stable"  18% 20.4MB/s 14.9s
Download snap "google-cloud-sdk" (460) from channel "stable"  18% 20.4MB/s 14.8s
Download snap "google-cloud-sdk" (460) from channel "stable"  19% 20.7MB/s 14.4s
Download snap "google-cloud-sdk" (460) from channel "stable"  20% 20.5MB/s 14.5s
Download snap "google-cloud-sdk" (460) from channel "stable"  20% 20.6MB/s 14.3s
Download snap "google-cloud-sdk" (460) from channel "stable"  21% 20.8MB/s 14.0s
Download snap "google-cloud-sdk" (460) from channel "stable"  22% 21.1MB/s 13.7s
Download snap "google-cloud-sdk" (460) from channel "stable"  23% 21.1MB/s 13.6s
Download snap "google-cloud-sdk" (460) from channel "stable"  23% 21.1MB/s 13.5s
Download snap "google-cloud-sdk" (460) from channel "stable"  24% 21.3MB/s 13.2s
Download snap "google-cloud-sdk" (460) from channel "stable"  25% 21.3MB/s 13.1s
Download snap "google-cloud-sdk" (460) from channel "stable"  25% 21.5MB/s 12.8s
Download snap "google-cloud-sdk" (460) from channel "stable"  26% 21.6MB/s 12.7s
Download snap "google-cloud-sdk" (460) from channel "stable"  27% 21.7MB/s 12.5s
Download snap "google-cloud-sdk" (460) from channel "stable"  27% 21.7MB/s 12.4s
Download snap "google-cloud-sdk" (460) from channel "stable"  28% 21.8MB/s 12.3s
Download snap "google-cloud-sdk" (460) from channel "stable"  29% 21.8MB/s 12.2s
Download snap "google-cloud-sdk" (460) from channel "stable"  29% 21.9MB/s 11.9s
Download snap "google-cloud-sdk" (460) from channel "stable"  30% 22.1MB/s 11.7s
Download snap "google-cloud-sdk" (460) from channel "stable"  31% 22.1MB/s 11.6s
Download snap "google-cloud-sdk" (460) from channel "stable"  31% 22.1MB/s 11.5s
Download snap "google-cloud-sdk" (460) from channel "stable"  32% 22.2MB/s 11.3s
Download snap "google-cloud-sdk" (460) from channel "stable"  33% 22.4MB/s 11.1s
Download snap "google-cloud-sdk" (460) from channel "stable"  34% 22.5MB/s 10.9s
Download snap "google-cloud-sdk" (460) from channel "stable"  34% 22.5MB/s 10.8s
Download snap "google-cloud-sdk" (460) from channel "stable"  35% 22.5MB/s 10.7s
Download snap "google-cloud-sdk" (460) from channel "stable"  36% 22.5MB/s 10.6s
Download snap "google-cloud-sdk" (460) from channel "stable"  36% 22.5MB/s 10.5s
Download snap "google-cloud-sdk" (460) from channel "stable"  37% 22.6MB/s 10.3s
Download snap "google-cloud-sdk" (460) from channel "stable"  38% 22.6MB/s 10.2s
Download snap "google-cloud-sdk" (460) from channel "stable"  38% 22.6MB/s 10.1s
Download snap "google-cloud-sdk" (460) from channel "stable"  39% 22.6MB/s 10.0s
Download snap "google-cloud-sdk" (460) from channel "stable"  40% 22.6MB/s 9.92s
Download snap "google-cloud-sdk" (460) from channel "stable"  40% 22.7MB/s 9.74s
Download snap "google-cloud-sdk" (460) from channel "stable"  41% 22.7MB/s 9.64s
Download snap "google-cloud-sdk" (460) from channel "stable"  42% 22.8MB/s 9.47s
Download snap "google-cloud-sdk" (460) from channel "stable"  43% 22.9MB/s 9.29s
Download snap "google-cloud-sdk" (460) from channel "stable"  43% 22.9MB/s 9.20s
Download snap "google-cloud-sdk" (460) from channel "stable"  44% 23.0MB/s 9.03s
Download snap "google-cloud-sdk" (460) from channel "stable"  45% 23.0MB/s 8.94s
Download snap "google-cloud-sdk" (460) from channel "stable"  45% 22.9MB/s 8.84s
Download snap "google-cloud-sdk" (460) from channel "stable"  46% 22.9MB/s 8.75s
Download snap "google-cloud-sdk" (460) from channel "stable"  46% 22.9MB/s 8.65s
Download snap "google-cloud-sdk" (460) from channel "stable"  47% 23.0MB/s 8.49s
Download snap "google-cloud-sdk" (460) from channel "stable"  48% 23.1MB/s 8.33s
Download snap "google-cloud-sdk" (460) from channel "stable"  49% 23.2MB/s 8.17s
Download snap "google-cloud-sdk" (460) from channel "stable"  49% 23.2MB/s 8.08s
Download snap "google-cloud-sdk" (460) from channel "stable"  50% 23.2MB/s 7.98s
Download snap "google-cloud-sdk" (460) from channel "stable"  51% 23.2MB/s 7.82s
Download snap "google-cloud-sdk" (460) from channel "stable"  51% 23.2MB/s 7.73s
Download snap "google-cloud-sdk" (460) from channel "stable"  52% 23.2MB/s 7.64s
Download snap "google-cloud-sdk" (460) from channel "stable"  53% 23.2MB/s 7.55s
Download snap "google-cloud-sdk" (460) from channel "stable"  54% 23.3MB/s 7.39s
Download snap "google-cloud-sdk" (460) from channel "stable"  54% 23.3MB/s 7.30s
Download snap "google-cloud-sdk" (460) from channel "stable"  55% 23.3MB/s 7.15s
Download snap "google-cloud-sdk" (460) from channel "stable"  56% 23.3MB/s 7.05s
Download snap "google-cloud-sdk" (460) from channel "stable"  56% 23.4MB/s 6.90s
Download snap "google-cloud-sdk" (460) from channel "stable"  57% 23.3MB/s 6.87s
Download snap "google-cloud-sdk" (460) from channel "stable"  58% 23.4MB/s 6.72s
Download snap "google-cloud-sdk" (460) from channel "stable"  58% 23.4MB/s 6.63s
Download snap "google-cloud-sdk" (460) from channel "stable"  59% 23.4MB/s 6.48s
Download snap "google-cloud-sdk" (460) from channel "stable"  60% 23.4MB/s 6.39s
Download snap "google-cloud-sdk" (460) from channel "stable"  60% 23.4MB/s 6.29s
Download snap "google-cloud-sdk" (460) from channel "stable"  61% 23.5MB/s 6.15s
Download snap "google-cloud-sdk" (460) from channel "stable"  62% 23.5MB/s 6.06s
Download snap "google-cloud-sdk" (460) from channel "stable"  62% 23.5MB/s 5.91s
Download snap "google-cloud-sdk" (460) from channel "stable"  63% 23.5MB/s 5.82s
Download snap "google-cloud-sdk" (460) from channel "stable"  64% 23.5MB/s 5.73s
Download snap "google-cloud-sdk" (460) from channel "stable"  64% 23.5MB/s 5.63s
Download snap "google-cloud-sdk" (460) from channel "stable"  65% 23.5MB/s 5.49s
Download snap "google-cloud-sdk" (460) from channel "stable"  66% 23.5MB/s 5.40s
Download snap "google-cloud-sdk" (460) from channel "stable"  66% 23.6MB/s 5.26s
Download snap "google-cloud-sdk" (460) from channel "stable"  67% 23.6MB/s 5.17s
Download snap "google-cloud-sdk" (460) from channel "stable"  68% 23.6MB/s 5.07s
Download snap "google-cloud-sdk" (460) from channel "stable"  68% 23.6MB/s 4.98s
Download snap "google-cloud-sdk" (460) from channel "stable"  69% 23.6MB/s 4.84s
Download snap "google-cloud-sdk" (460) from channel "stable"  70% 23.7MB/s 4.70s
Download snap "google-cloud-sdk" (460) from channel "stable"  71% 23.7MB/s 4.61s
Download snap "google-cloud-sdk" (460) from channel "stable"  71% 23.6MB/s 4.52s
Download snap "google-cloud-sdk" (460) from channel "stable"  72% 23.6MB/s 4.43s
Download snap "google-cloud-sdk" (460) from channel "stable"  73% 23.7MB/s 4.29s
Download snap "google-cloud-sdk" (460) from channel "stable"  73% 23.7MB/s 4.15s
Download snap "google-cloud-sdk" (460) from channel "stable"  74% 23.7MB/s 4.06s
Download snap "google-cloud-sdk" (460) from channel "stable"  75% 23.7MB/s 3.97s
Download snap "google-cloud-sdk" (460) from channel "stable"  75% 23.8MB/s 3.83s
Download snap "google-cloud-sdk" (460) from channel "stable"  76% 23.7MB/s 3.74s
Download snap "google-cloud-sdk" (460) from channel "stable"  77% 23.8MB/s 3.60s
Download snap "google-cloud-sdk" (460) from channel "stable"  78% 23.8MB/s 3.47s
Download snap "google-cloud-sdk" (460) from channel "stable"  78% 23.8MB/s 3.42s
Download snap "google-cloud-sdk" (460) from channel "stable"  78% 23.6MB/s 3.45s
Download snap "google-cloud-sdk" (460) from channel "stable"  78% 23.4MB/s 3.44s
Download snap "google-cloud-sdk" (460) from channel "stable"  78% 23.3MB/s 3.42s
Download snap "google-cloud-sdk" (460) from channel "stable"  79% 23.3MB/s 3.33s
Download snap "google-cloud-sdk" (460) from channel "stable"  80% 23.3MB/s 3.19s
Download snap "google-cloud-sdk" (460) from channel "stable"  80% 23.3MB/s 3.10s
Download snap "google-cloud-sdk" (460) from channel "stable"  81% 23.4MB/s 2.96s
Download snap "google-cloud-sdk" (460) from channel "stable"  82% 23.3MB/s 2.91s
Download snap "google-cloud-sdk" (460) from channel "stable"  83% 23.4MB/s 2.77s
Download snap "google-cloud-sdk" (460) from channel "stable"  83% 23.4MB/s 2.64s
Download snap "google-cloud-sdk" (460) from channel "stable"  84% 23.4MB/s 2.54s
Download snap "google-cloud-sdk" (460) from channel "stable"  85% 23.4MB/s 2.45s
Download snap "google-cloud-sdk" (460) from channel "stable"  85% 23.4MB/s 2.31s
Download snap "google-cloud-sdk" (460) from channel "stable"  86% 23.4MB/s 2.22s
Download snap "google-cloud-sdk" (460) from channel "stable"  87% 23.5MB/s 2.09s
Download snap "google-cloud-sdk" (460) from channel "stable"  87% 23.5MB/s 1.99s
Download snap "google-cloud-sdk" (460) from channel "stable"  88% 23.5MB/s 1.90s
Download snap "google-cloud-sdk" (460) from channel "stable"  89% 23.5MB/s 1.76s
Download snap "google-cloud-sdk" (460) from channel "stable"  89% 23.5MB/s 1.67s
Download snap "google-cloud-sdk" (460) from channel "stable"  90% 23.5MB/s 1.54s
Download snap "google-cloud-sdk" (460) from channel "stable"  91% 23.5MB/s 1.44s
Download snap "google-cloud-sdk" (460) from channel "stable"  91% 23.5MB/s 1.35s
Download snap "google-cloud-sdk" (460) from channel "stable"  92% 23.5MB/s 1.25s
Download snap "google-cloud-sdk" (460) from channel "stable"  93% 23.6MB/s 1.12s
Download snap "google-cloud-sdk" (460) from channel "stable"  94% 23.6MB/s 994ms
Download snap "google-cloud-sdk" (460) from channel "stable"  94% 23.6MB/s 866ms
Download snap "google-cloud-sdk" (460) from channel "stable"  95% 23.6MB/s 771ms
Download snap "google-cloud-sdk" (460) from channel "stable"  96% 23.6MB/s 676ms
Download snap "google-cloud-sdk" (460) from channel "stable"  96% 23.6MB/s 581ms
Download snap "google-cloud-sdk" (460) from channel "stable"  97% 23.7MB/s 453ms
Download snap "google-cloud-sdk" (460) from channel "stable"  98% 23.6MB/s 358ms
Download snap "google-cloud-sdk" (460) from channel "stable"  99% 23.7MB/s 230ms
Download snap "google-cloud-sdk" (460) from channel "stable"  99% 23.7MB/s 135ms
Download snap "google-cloud-sdk" (460) from channel "stable" 100% 23.7MB/s 0.0ns
Download snap "google-cloud-sdk" (460) from channel "stable" 100% 23.6MB/s 0.0ns
Download snap "google-cloud-sdk" (460) from channel "stable" 100% 23.4MB/s 0.0ns
Download snap "google-cloud-sdk" (460) from channel "stable" 100% 23.3MB/s 0.0ns
Download snap "google-cloud-sdk" (460) from channel "stable" 100% 23.1MB/s 0.0ns
Download snap "google-cloud-sdk" (460) from channel "stable" 100% 23.0MB/s 0.0ns
Download snap "google-cloud-sdk" (460) from channel "stable" 100% 22.8MB/s 0.0ns
Download snap "google-cloud-sdk" (460) from channel "stable" 100% 22.7MB/s 0.0ns
Download snap "google-cloud-sdk" (460) from channel "stable" 100% 22.6MB/s 0.0ns
Download snap "google-cloud-sdk" (460) from channel "stable" 100% 22.4MB/s 0.0ns
Download snap "google-cloud-sdk" (460) from channel "stable" 100% 22.3MB/s 0.0ns
Download snap "google-cloud-sdk" (460) from channel "stable" 100% 22.1MB/s 0.0ns
Download snap "google-cloud-sdk" (460) from channel "stable" 100% 22.0MB/s 0.0ns
Download snap "google-cloud-sdk" (460) from channel "stable" 100% 21.9MB/s 0.0ns
Fetch and check assertions for snap "google-cloud-sdk" (460)                   -
Fetch and check assertions for snap "google-cloud-sdk" (460)                   \
Fetch and check assertions for snap "google-cloud-sdk" (460)                   |
Fetch and check assertions for snap "google-cloud-sdk" (460)                   /
Fetch and check assertions for snap "google-cloud-sdk" (460)                   -
Fetch and check assertions for snap "google-cloud-sdk" (460)                   \
Fetch and check assertions for snap "google-cloud-sdk" (460)                   |
Mount snap "google-cloud-sdk" (460)                                            /
Mount snap "google-cloud-sdk" (460)                                            -
Mount snap "google-cloud-sdk" (460)                                            \
Mount snap "google-cloud-sdk" (460)                                            |
Mount snap "google-cloud-sdk" (460)                                            /
Mount snap "google-cloud-sdk" (460)                                            -
Mount snap "google-cloud-sdk" (460)                                            \
Mount snap "google-cloud-sdk" (460)                                            |
Mount snap "google-cloud-sdk" (460)                                            /
Mount snap "google-cloud-sdk" (460)                                            -
Mount snap "google-cloud-sdk" (460)                                            \
Mount snap "google-cloud-sdk" (460)                                            |
Mount snap "google-cloud-sdk" (460)                                            /
Mount snap "google-cloud-sdk" (460)                                            -
Mount snap "google-cloud-sdk" (460)                                            \
Mount snap "google-cloud-sdk" (460)                                            |
Mount snap "google-cloud-sdk" (460)                                            /
Mount snap "google-cloud-sdk" (460)                                            -
Mount snap "google-cloud-sdk" (460)                                            \
Mount snap "google-cloud-sdk" (460)                                            |
Mount snap "google-cloud-sdk" (460)                                            /
[?25hgoogle-cloud-sdk 481.0.0 from Cloud SDK (google-cloud-sdk**) installed
travis_time:end:00734a29:start=1718806172127786415,finish=1718806199815535827,duration=27687749412,event=prepare
travis_time:start:2fc80e4d
$ sudo snap install vault

Ensure prerequisites for "vault" are available                                 /
Ensure prerequisites for "vault" are available                                 -
Ensure prerequisites for "vault" are available                                 \
Download snap "core22" (1380) from channel "stable"                            |
Download snap "core22" (1380) from channel "stable"                            /
Download snap "core22" (1380) from channel "stable"                            -
Download snap "core22" (1380) from channel "stable"                            \
Download snap "core22" (1380) from channel "stable"                            |
Download snap "core22" (1380) from channel "stable"                            /
Download snap "core22" (1380) from channel "stable"                            -
Download snap "core22" (1380) from channel "stable"                            \[?25l
Download snap "core22" (1380) from channel "stable"            0%     0B/s ages!
Download snap "core22" (1380) from channel "stable"            0%     0B/s ages!
Download snap "core22" (1380) from channel "stable"            0%     0B/s ages!
Download snap "core22" (1380) from channel "stable"            0%  402kB/s 3m13s
Download snap "core22" (1380) from channel "stable"            0%  644kB/s 2m00s
Download snap "core22" (1380) from channel "stable"            1% 1.07MB/s 1m12s
Download snap "core22" (1380) from channel "stable"            2% 2.07MB/s 36.9s
Download snap "core22" (1380) from channel "stable"            4% 3.43MB/s 21.9s
Download snap "core22" (1380) from channel "stable"            7% 5.73MB/s 12.7s
Download snap "core22" (1380) from channel "stable"           10% 7.58MB/s 9.26s
Download snap "core22" (1380) from channel "stable"           13% 9.24MB/s 7.31s
Download snap "core22" (1380) from channel "stable"           17% 10.6MB/s 6.12s
Download snap "core22" (1380) from channel "stable"           19% 11.5MB/s 5.43s
Download snap "core22" (1380) from channel "stable"           23% 12.4MB/s 4.84s
Download snap "core22" (1380) from channel "stable"           26% 13.3MB/s 4.32s
Download snap "core22" (1380) from channel "stable"           29% 14.1MB/s 3.90s
Download snap "core22" (1380) from channel "stable"           33% 14.9MB/s 3.51s
Download snap "core22" (1380) from channel "stable"           36% 15.5MB/s 3.20s
Download snap "core22" (1380) from channel "stable"           40% 16.1MB/s 2.91s
Download snap "core22" (1380) from channel "stable"           44% 16.8MB/s 2.62s
Download snap "core22" (1380) from channel "stable"           47% 17.0MB/s 2.44s
Download snap "core22" (1380) from channel "stable"           50% 17.4MB/s 2.26s
Download snap "core22" (1380) from channel "stable"           52% 17.5MB/s 2.11s
Download snap "core22" (1380) from channel "stable"           55% 17.7MB/s 1.96s
Download snap "core22" (1380) from channel "stable"           58% 18.0MB/s 1.80s
Download snap "core22" (1380) from channel "stable"           62% 18.4MB/s 1.61s
Download snap "core22" (1380) from channel "stable"           66% 18.8MB/s 1.41s
Download snap "core22" (1380) from channel "stable"           69% 19.1MB/s 1.25s
Download snap "core22" (1380) from channel "stable"           73% 19.3MB/s 1.09s
Download snap "core22" (1380) from channel "stable"           76% 19.6MB/s 943ms
Download snap "core22" (1380) from channel "stable"           79% 19.7MB/s 812ms
Download snap "core22" (1380) from channel "stable"           82% 19.7MB/s 703ms
Download snap "core22" (1380) from channel "stable"           85% 19.9MB/s 575ms
Download snap "core22" (1380) from channel "stable"           89% 20.0MB/s 439ms
Download snap "core22" (1380) from channel "stable"           91% 20.0MB/s 342ms
Download snap "core22" (1380) from channel "stable"           95% 20.3MB/s 193ms
Download snap "core22" (1380) from channel "stable"           99% 20.6MB/s  40ms
Download snap "core22" (1380) from channel "stable"          100% 20.2MB/s 0.0ns
Download snap "core22" (1380) from channel "stable"          100% 19.7MB/s 0.0ns
Fetch and check assertions for snap "core22" (1380)                            |
Fetch and check assertions for snap "core22" (1380)                            /
Fetch and check assertions for snap "core22" (1380)                            -
Fetch and check assertions for snap "core22" (1380)                            \
Fetch and check assertions for snap "core22" (1380)                            |
Fetch and check assertions for snap "core22" (1380)                            /
Fetch and check assertions for snap "core22" (1380)                            -
Mount snap "core22" (1380)                                                     \
Mount snap "core22" (1380)                                                     |
Mount snap "core22" (1380)                                                     /
Mount snap "core22" (1380)                                                     -
Mount snap "core22" (1380)                                                     \
Mount snap "core22" (1380)                                                     |
Setup snap "core22" aliases                                                    /
Download snap "vault" (2275) from channel "1.16/stable"                        -
Download snap "vault" (2275) from channel "1.16/stable"                        \
Download snap "vault" (2275) from channel "1.16/stable"                        |
Download snap "vault" (2275) from channel "1.16/stable"                        /
Download snap "vault" (2275) from channel "1.16/stable"                        -[?25l
Download snap "vault" (2275) from channel "1.16/stable"        0%     0B/s ages!
Download snap "vault" (2275) from channel "1.16/stable"        0% 4.02MB/s 48.5s
Download snap "vault" (2275) from channel "1.16/stable"        3% 18.8MB/s 10.1s
Download snap "vault" (2275) from channel "1.16/stable"        7% 32.1MB/s 5.71s
Download snap "vault" (2275) from channel "1.16/stable"       10% 40.1MB/s 4.38s
Download snap "vault" (2275) from channel "1.16/stable"       14% 45.5MB/s 3.70s
Download snap "vault" (2275) from channel "1.16/stable"       18% 49.3MB/s 3.27s
Download snap "vault" (2275) from channel "1.16/stable"       21% 51.7MB/s 2.98s
Download snap "vault" (2275) from channel "1.16/stable"       25% 54.4MB/s 2.69s
Download snap "vault" (2275) from channel "1.16/stable"       29% 55.8MB/s 2.50s
Download snap "vault" (2275) from channel "1.16/stable"       33% 57.3MB/s 2.30s
Download snap "vault" (2275) from channel "1.16/stable"       36% 58.6MB/s 2.13s
Download snap "vault" (2275) from channel "1.16/stable"       40% 59.3MB/s 1.98s
Download snap "vault" (2275) from channel "1.16/stable"       44% 60.4MB/s 1.82s
Download snap "vault" (2275) from channel "1.16/stable"       48% 61.2MB/s 1.67s
Download snap "vault" (2275) from channel "1.16/stable"       51% 61.7MB/s 1.55s
Download snap "vault" (2275) from channel "1.16/stable"       55% 62.5MB/s 1.41s
Download snap "vault" (2275) from channel "1.16/stable"       59% 63.2MB/s 1.27s
Download snap "vault" (2275) from channel "1.16/stable"       62% 63.0MB/s 1.17s
Download snap "vault" (2275) from channel "1.16/stable"       66% 63.9MB/s 1.03s
Download snap "vault" (2275) from channel "1.16/stable"       70% 64.3MB/s 910ms
Download snap "vault" (2275) from channel "1.16/stable"       73% 64.3MB/s 808ms
Download snap "vault" (2275) from channel "1.16/stable"       78% 64.9MB/s 674ms
Download snap "vault" (2275) from channel "1.16/stable"       81% 65.1MB/s 566ms
Download snap "vault" (2275) from channel "1.16/stable"       85% 65.4MB/s 451ms
Download snap "vault" (2275) from channel "1.16/stable"       89% 65.6MB/s 338ms
Download snap "vault" (2275) from channel "1.16/stable"       92% 65.9MB/s 225ms
Download snap "vault" (2275) from channel "1.16/stable"       96% 65.9MB/s 120ms
Download snap "vault" (2275) from channel "1.16/stable"      100% 66.1MB/s 8.1ms
Download snap "vault" (2275) from channel "1.16/stable"      100% 64.1MB/s 0.0ns
Download snap "vault" (2275) from channel "1.16/stable"      100% 62.1MB/s 0.0ns
Download snap "vault" (2275) from channel "1.16/stable"      100% 60.1MB/s 0.0ns
Download snap "vault" (2275) from channel "1.16/stable"      100% 58.3MB/s 0.0ns
Download snap "vault" (2275) from channel "1.16/stable"      100% 56.6MB/s 0.0ns
Download snap "vault" (2275) from channel "1.16/stable"      100% 55.0MB/s 0.0ns
Download snap "vault" (2275) from channel "1.16/stable"      100% 53.5MB/s 0.0ns
Fetch and check assertions for snap "vault" (2275)                             \
Fetch and check assertions for snap "vault" (2275)                             |
Fetch and check assertions for snap "vault" (2275)                             /
Fetch and check assertions for snap "vault" (2275)                             -
Fetch and check assertions for snap "vault" (2275)                             \
Fetch and check assertions for snap "vault" (2275)                             |
Fetch and check assertions for snap "vault" (2275)                             /
Mount snap "vault" (2275)                                                      -
Mount snap "vault" (2275)                                                      \
Setup snap "vault" (2275) security profiles                                    |
Setup snap "vault" (2275) security profiles for auto-connections               /
Run install hook of "vault" snap if present                                    -
Run install hook of "vault" snap if present                                    \
Run install hook of "vault" snap if present                                    |
Run install hook of "vault" snap if present                                    /
Run install hook of "vault" snap if present                                    -
[?25hvault (1.16/stable) 1.16.2 from Canonical** installed
travis_time:end:2fc80e4d:start=1718806199823670326,finish=1718806214003881900,duration=14180211574,event=prepare
travis_time:start:12163170
$ sudo snap list
Name              Version    Rev    Tracking       Publisher           Notes
core              16-2.61.2  16928  latest/stable  canonical**         core
core20            20240416   2318   latest/stable  canonical**         base
core22            20240408   1380   latest/stable  canonical**         base
google-cloud-sdk  481.0.0    460    latest/stable  google-cloud-sdk**  classic
vault             1.16.2     2275   1.16/stable    canonical**         -
travis_time:end:12163170:start=1718806214009985066,finish=1718806214057134573,duration=47149507,event=prepare
travis_fold:end:snap

travis_time:start:195ce0a8
travis_fold:start:services
travis_time:start:2b7723a6
$ sudo systemctl start rabbitmq-server
Failed to start rabbitmq-server.service: Unit rabbitmq-server.service not found.
travis_time:end:2b7723a6:start=1718806214068482174,finish=1718806214080638358,duration=12156184,event=prepare
travis_time:start:2245e063
$ sudo systemctl start docker
travis_time:end:2245e063:start=1718806214088972642,finish=1718806214101897863,duration=12925221,event=prepare
travis_time:start:2d8699b2
$ sudo systemctl start redis-server
travis_time:end:2d8699b2:start=1718806214110004260,finish=1718806214172660000,duration=62655740,event=prepare
travis_fold:end:services
travis_time:end:2d8699b2:start=1718806214110004260,finish=1718806217180954147,duration=3070949887,event=services
travis_time:start:03dab57a
travis_time:end:03dab57a:start=1718806217188689290,finish=1718806217192681575,duration=3992285,event=fix_ps4
Updating gimme
travis_time:start:17d4fc6c

travis_fold:start:git.checkout
travis_time:start:0a64e8e4
travis_time:end:0a64e8e4:start=1718806223373191619,finish=1718806223378133755,duration=4942136,event=checkout
travis_time:start:1da639e4
$ git clone --depth=10 --branch=kw-updated_worker https://github.com/travis-ci/worker.git travis-ci/worker
Cloning into 'travis-ci/worker'...
travis_time:end:1da639e4:start=1718806223382355043,finish=1718806224013910796,duration=631555753,event=checkout
$ cd travis-ci/worker
$ git checkout -qf 9e470782a35ce1ac63ecebc3def3fd6aab395c88
travis_fold:end:git.checkout

travis_time:end:1da639e4:start=1718806223382355043,finish=1718806224028802508,duration=646447465,event=checkout
$ travis_export_go 1.17.x github.com/travis-ci/worker
travis_time:start:1098dd2e

Setting environment variables from repository settings
$ export ARTIFACTS_PATHS=./build
$ export ARTIFACTS_BUCKET=travis-worker-artifacts
$ export ARTIFACTS_PERMISSIONS=public-read
$ export ARTIFACTS_KEY=[secure]
$ export ARTIFACTS_SECRET=[secure]
$ export PACKAGECLOUD_TOKEN=[secure]
$ export DOCKER_HUB_TRIGGER_URL=[secure]
$ export DOCKER_LOGIN_USERNAME=[secure]
$ export DOCKER_LOGIN_PASSWORD=[secure]
$ export VAULT_PASS=[secure]
$ export GCE_PROJECT=[secure]
$ export VAULT_USERNAME=[secure]
$ export VAULT_ADDR=[secure]
$ export CLOUDSDK_CORE_DISABLE_PROMPTS=[secure]

Setting environment variables from .travis.yml
$ export AMQP_URI="amqp://"
$ export GOPATH="$HOME/gopath"
$ export PATH="bin:$HOME/gopath/bin:$HOME/bin:$PATH"
$ export CHECKOUT_ROOT="$HOME/gopath/src/github.com/travis-ci/worker"
$ export GO15VENDOREXPERIMENT='1'
$ export REDIS_URL="redis://"

travis_time:end:1098dd2e:start=1718806224037482340,finish=1718806224058783187,duration=21300847,event=env
travis_time:start:34f90194
$ travis_setup_go
go version go1.17.13 linux/amd64
$ export GOPATH="/home/travis/gopath"
$ export PATH="/home/travis/gopath/bin:/home/travis/.gimme/versions/go1.17.13.linux.amd64/bin:bin:/home/travis/gopath/bin:/home/travis/bin:/home/travis/bin:/home/travis/bin:/home/travis/.local/bin:/usr/local/lib/jvm/openjdk11/bin:/opt/pyenv/shims:/home/travis/.phpenv/shims:/home/travis/perl5/perlbrew/bin:/home/travis/perl5/perlbrew/perls/5.34.1/bin:/home/travis/.nvm/versions/node/v16.16.0/bin:/home/travis/.rvm/gems/ruby-2.7.6/bin:/home/travis/.rvm/gems/ruby-2.7.6@global/bin:/home/travis/.rvm/rubies/ruby-2.7.6/bin:/home/travis/gopath/bin:/home/travis/.gimme/versions/go1.18.4.linux.amd64/bin:/usr/local/maven-3.8.8/bin:/usr/local/cmake-3.26.3/bin:/usr/local/clang-7.0.0/bin:/usr/local/sbin:/usr/local/bin:/usr/sbin:/usr/bin:/sbin:/bin:/snap/bin:/home/travis/.rvm/bin:/home/travis/.phpenv/bin:/opt/pyenv/bin:/home/travis/.yarn/bin"
$ export GO111MODULE="auto"
travis_time:end:34f90194:start=1718806224065324267,finish=1718806228356523983,duration=4291199716,event=
travis_fold:start:cache.1
Setting up build cache
$ export CASHER_DIR=${TRAVIS_HOME}/.casher
travis_time:start:016991d0
$ Installing caching utilities
travis_time:end:016991d0:start=1718806229135816085,finish=1718806229405341705,duration=269525620,event=setup_casher
travis_time:start:05458837
travis_time:end:05458837:start=1718806229416072681,finish=1718806229420818799,duration=4746118,event=setup_casher
travis_time:start:2634a1cc
attempting to download cache archive
fetching kw-updated_worker/cache--linux-xenial-8e66efc74188d5464db6c5a9d3decd4835ed340208a6ac39f04af14f2f93a35a--go-1.17.x.tgz
found cache
travis_time:end:2634a1cc:start=1718806229431271339,finish=1718806237081180402,duration=7649909063,event=setup_casher
travis_time:start:00c2c0c9
travis_time:end:00c2c0c9:start=1718806237086479578,finish=1718806237090405441,duration=3925863,event=setup_casher
travis_time:start:08363ad0
adding /home/travis/gopath/src/github.com/travis-ci/worker/vendor to cache
creating directory /home/travis/gopath/src/github.com/travis-ci/worker/vendor
adding /home/travis/.cache/go-build to cache
adding /home/travis/gopath/bin to cache
adding /home/travis/gopath/pkg/mod to cache
creating directory /home/travis/gopath/pkg/mod
travis_time:end:08363ad0:start=1718806237095499593,finish=1718806285181790864,duration=48086291271,event=setup_casher
travis_fold:end:cache.1

$ gimme version
v1.5.4
$ go version
go version go1.17.13 linux/amd64
travis_fold:start:go.env
$ go env
GO111MODULE="auto"
GOARCH="amd64"
GOBIN=""
GOCACHE="/home/travis/.cache/go-build"
GOENV="/home/travis/.config/go/env"
GOEXE=""
GOEXPERIMENT=""
GOFLAGS=""
GOHOSTARCH="amd64"
GOHOSTOS="linux"
GOINSECURE=""
GOMODCACHE="/home/travis/gopath/pkg/mod"
GONOPROXY=""
GONOSUMDB=""
GOOS="linux"
GOPATH="/home/travis/gopath"
GOPRIVATE=""
GOPROXY="https://proxy.golang.org,direct"
GOROOT="/home/travis/.gimme/versions/go1.17.13.linux.amd64"
GOSUMDB="sum.golang.org"
GOTMPDIR=""
GOTOOLDIR="/home/travis/.gimme/versions/go1.17.13.linux.amd64/pkg/tool/linux_amd64"
GOVCS=""
GOVERSION="go1.17.13"
GCCGO="gccgo"
AR="ar"
CC="gcc"
CXX="g++"
CGO_ENABLED="1"
GOMOD="/home/travis/gopath/src/github.com/travis-ci/worker/go.mod"
CGO_CFLAGS="-g -O2"
CGO_CPPFLAGS=""
CGO_CXXFLAGS="-g -O2"
CGO_FFLAGS="-g -O2"
CGO_LDFLAGS="-g -O2"
PKG_CONFIG="pkg-config"
GOGCCFLAGS="-fPIC -m64 -pthread -fmessage-length=0 -fdebug-prefix-map=/tmp/go-build1788341715=/tmp/go-build -gno-record-gcc-switches"
travis_fold:end:go.env
travis_fold:start:install
travis_time:start:1e024fe0
$ travis_install_go_dependencies 1.17.x -v
Makefile detected
travis_time:end:1e024fe0:start=1718806285387320562,finish=1718806285392620726,duration=5300164,event=install
travis_fold:end:install
travis_time:start:12b3d2e8
$ vault login --no-print -method=userpass username=$VAULT_USERNAME password=$VAULT_PASS
travis_time:end:12b3d2e8:start=1718806285399986194,finish=1718806289424534173,duration=4024547979,event=script
The command "vault login --no-print -method=userpass username=$VAULT_USERNAME password=$VAULT_PASS" exited with 0.
travis_time:start:0b503908
$ vault kv get -field=secret gcp/[secure]-sa-key > /tmp/[secure]_key.json;
travis_time:end:0b503908:start=1718806289438110816,finish=1718806289723797271,duration=285686455,event=script
The command "vault kv get -field=secret gcp/[secure]-sa-key > /tmp/[secure]_key.json;" exited with 0.
travis_time:start:037321a0
$ gcloud -q auth activate-service-account --key-file /tmp/[secure]_key.json;
Activated service account credentials for: [sa-docker-images@[secure].iam.gserviceaccount.com]
travis_time:end:037321a0:start=1718806289739000379,finish=1718806291571855119,duration=1832854740,event=script
The command "gcloud -q auth activate-service-account --key-file /tmp/[secure]_key.json;" exited with 0.
travis_time:start:1465e25b
$ gcloud -q config set project ${GCE_PROJECT}
Updated property [core/project].
WARNING: You do not appear to have access to project [[secure]] or it does not exist.
travis_time:end:1465e25b:start=1718806291587634085,finish=1718806292884224893,duration=1296590808,event=script
The command "gcloud -q config set project ${GCE_PROJECT}" exited with 0.
travis_time:start:014aee7a
$ gcloud auth configure-docker
Adding credentials for all GCR repositories.
WARNING: A long list of credential helpers may cause delays running 'docker build'. We recommend passing the registry name to configure only the registry you are using.
Docker configuration file updated.
travis_time:end:014aee7a:start=1718806292889508580,finish=1718806294323754464,duration=1434245884,event=script
The command "gcloud auth configure-docker" exited with 0.
travis_time:start:014b0515
$ make docker-build
docker build -t [secure].io/[secure]/worker:v6.2.24-6-g9e47078 .
Sending build context to Docker daemon  54.48MB


Step 1/16 : FROM golang:1.21 as builder
1.21: Pulling from library/golang
fea1432adf09: Pulling fs layer
5651b5803b18: Pulling fs layer
3873416e6a33: Pulling fs layer
6efb595508de: Pulling fs layer
98b7747f5ef5: Pulling fs layer
1a74743e93e9: Pulling fs layer
4f4fb700ef54: Pulling fs layer
98b7747f5ef5: Waiting
1a74743e93e9: Waiting
4f4fb700ef54: Waiting
6efb595508de: Waiting
5651b5803b18: Verifying Checksum
5651b5803b18: Download complete
fea1432adf09: Verifying Checksum
fea1432adf09: Download complete
3873416e6a33: Verifying Checksum
3873416e6a33: Download complete
1a74743e93e9: Verifying Checksum
1a74743e93e9: Download complete
4f4fb700ef54: Verifying Checksum
4f4fb700ef54: Download complete
98b7747f5ef5: Verifying Checksum
98b7747f5ef5: Download complete
6efb595508de: Verifying Checksum
6efb595508de: Download complete
fea1432adf09: Pull complete
5651b5803b18: Pull complete
3873416e6a33: Pull complete
6efb595508de: Pull complete
98b7747f5ef5: Pull complete
1a74743e93e9: Pull complete
4f4fb700ef54: Pull complete
Digest: sha256:2eb85b8942c29145b4a5bed2d0f3dc1a3ba2f823aec74afe16751da108a585e1
Status: Downloaded newer image for golang:1.21
 ---> 4b088a6b9b88
Step 2/16 : MAINTAINER Travis CI GmbH <support+travis-worker-docker-image@travis-ci.org>
 ---> Running in 581f5070b17b
Removing intermediate container 581f5070b17b
 ---> 0ed30e990056
Step 3/16 : COPY . /go/src/github.com/travis-ci/worker
 ---> ca73d2ea91b6
Step 4/16 : WORKDIR /go/src/github.com/travis-ci/worker
 ---> Running in 5bae39e81deb
Removing intermediate container 5bae39e81deb
 ---> 4d011297d0b4
Step 5/16 : ENV CGO_ENABLED 0
 ---> Running in bba3841f0935
Removing intermediate container bba3841f0935
 ---> df299fee6806
Step 6/16 : RUN make build
 ---> Running in f54fc08742f3
make: bash: Operation not permitted
make: bash: Operation not permitted
make: bash: Operation not permitted
make: bash: Operation not permitted
make: bash: Operation not permitted
make: *** [Makefile:104: .deps-fetched] Error 127
GO111MODULE=on go mod download
The command '/bin/sh -c make build' returned a non-zero code: 2
Makefile:84: recipe for target 'docker-build' failed
make: *** [docker-build] Error 2
travis_time:end:014b0515:start=1718806294334149513,finish=1718806323887315989,duration=29553166476,event=script
The command "make docker-build" exited with 2.
travis_time:start:0623a759
$ make docker-push
./script/docker-push
time=2024-06-19T14:12:03Z msg="docker login"
WARNING! Your password will be stored unencrypted in /home/travis/.docker/config.json.
Configure a credential helper to remove this warning. See
https://docs.docker.com/engine/reference/commandline/login/#credentials-store

Login Succeeded
time=2024-06-19T14:12:04Z msg="docker push" dest=[secure].io/[secure]/worker:v6.2.24-6-g9e47078 attempt=1
The push refers to repository [[secure].io/[secure]/worker]
An image does not exist locally with the tag: [secure].io/[secure]/worker
time=2024-06-19T14:12:04Z msg="sleeping" interval=10
time=2024-06-19T14:12:14Z msg="docker push" dest=[secure].io/[secure]/worker:v6.2.24-6-g9e47078 attempt=2
The push refers to repository [[secure].io/[secure]/worker]
An image does not exist locally with the tag: [secure].io/[secure]/worker
time=2024-06-19T14:12:15Z msg="sleeping" interval=20
time=2024-06-19T14:12:35Z msg="docker push" dest=[secure].io/[secure]/worker:v6.2.24-6-g9e47078 attempt=3
The push refers to repository [[secure].io/[secure]/worker]
An image does not exist locally with the tag: [secure].io/[secure]/worker
time=2024-06-19T14:12:36Z msg="sleeping" interval=30
time=2024-06-19T14:13:06Z msg="docker push" dest=[secure].io/[secure]/worker:v6.2.24-6-g9e47078 attempt=4
The push refers to repository [[secure].io/[secure]/worker]
An image does not exist locally with the tag: [secure].io/[secure]/worker
time=2024-06-19T14:13:06Z msg="sleeping" interval=40
time=2024-06-19T14:13:46Z msg="docker push" dest=[secure].io/[secure]/worker:v6.2.24-6-g9e47078 attempt=5
The push refers to repository [[secure].io/[secure]/worker]
An image does not exist locally with the tag: [secure].io/[secure]/worker
time=2024-06-19T14:13:47Z msg="sleeping" interval=50
time=2024-06-19T14:14:37Z msg="docker push" dest=[secure].io/[secure]/worker:v6.2.24-6-g9e47078 attempt=6
The push refers to repository [[secure].io/[secure]/worker]
An image does not exist locally with the tag: [secure].io/[secure]/worker
time=2024-06-19T14:14:37Z msg="sleeping" interval=60
time=2024-06-19T14:15:37Z msg="docker push" dest=[secure].io/[secure]/worker:v6.2.24-6-g9e47078 attempt=7
The push refers to repository [[secure].io/[secure]/worker]
An image does not exist locally with the tag: [secure].io/[secure]/worker
Makefile:53: recipe for target 'docker-push' failed
make: *** [docker-push] Error 86
travis_time:end:0623a759:start=1718806323896484795,finish=1718806538534668237,duration=214638183442,event=script
The command "make docker-push" exited with 2.
travis_fold:start:before_cache
travis_time:start:01de81fa
$ make clean
./script/clean
travis_time:end:01de81fa:start=1718806538541335129,finish=1718806539004229221,duration=462894092,event=before_cache
travis_fold:end:before_cache
travis_fold:start:cache.2
store build cache
travis_time:start:04916182
travis_time:end:04916182:start=1718806539010940662,finish=1718806539014866067,duration=3925405,event=cache
travis_time:start:0a177cb4
nothing changed
travis_time:end:0a177cb4:start=1718806539019943921,finish=1718806555072714226,duration=16052770305,event=cache
travis_fold:end:cache.2


Done. Your build exited with 1.