travis_fold:start:worker_info
Worker information
hostname: adf785a5-56cf-46b2-9aba-6c4b4d11a482@1.worker-n2-com-779d777f7b-twnw9.gce-production-1
version: 6.2.22 https://github.com/travis-ci/worker/tree/858cb91994a513269f2fe9782c15fc113e966231
instance: travis-job-b249164b-45c7-4526-adf7-e6fc53224ec6 travis-ci-sardonyx-xenial-1684402799-0876f6f0 (via amqp)
startup: 5.991541554s
travis_fold:end:worker_info
travis_time:start:15f1477e
travis_time:end:15f1477e:start=1718805549449342798,finish=1718805549605064333,duration=155721535,event=no_world_writable_dirs
travis_time:start:39fe9cd0
travis_time:end:39fe9cd0:start=1718805549607897568,finish=1718805549610965063,duration=3067495,event=setup_filter
travis_time:start:07eecffa
travis_time:end:07eecffa:start=1718805549615296785,finish=1718805549623251359,duration=7954574,event=agent
travis_time:start:08d3cd7a
travis_time:end:08d3cd7a:start=1718805549625970321,finish=1718805549628070709,duration=2100388,event=check_unsupported
travis_time:start:2b438713
travis_fold:start:system_info
Build system information
Build language: go
Build dist: xenial
Build id: 271035505
Job id: 623120382
Runtime kernel version: 4.15.0-1098-gcp
travis-build version: 3484ecfe
Build image provisioning date and time
Thu May 18 10:07:51 UTC 2023
Operating System Details
Distributor ID:	Ubuntu
Description:	Ubuntu 16.04.7 LTS
Release:	16.04
Codename:	xenial
Systemd Version
systemd 229
Cookbooks Version
d19e5ff https://github.com/travis-ci/travis-cookbooks/tree/d19e5ff
git version
git version 2.40.1
bash version
GNU bash, version 4.3.48(1)-release (x86_64-pc-linux-gnu)
gcc version
gcc (Ubuntu 5.4.0-6ubuntu1~16.04.12) 5.4.0 20160609
docker version
Client: Docker Engine - Community
 Version:           20.10.7
 API version:       1.41
 Go version:        go1.13.15
 Git commit:        f0df350
 Built:             Wed Jun  2 11:56:47 2021
 OS/Arch:           linux/amd64
 Context:           default
 Experimental:      true

Server: Docker Engine - Community
 Engine:
  Version:          20.10.7
  API version:      1.41 (minimum version 1.12)
  Go version:       go1.13.15
  Git commit:       b0f5bc3
  Built:            Wed Jun  2 11:54:58 2021
  OS/Arch:          linux/amd64
  Experimental:     false
 containerd:
  Version:          1.4.6
  GitCommit:        d71fcd7d8303cbf684402823e425e9dd2e99285d
 runc:
  Version:          1.0.0-rc95
  GitCommit:        b9ee9c6314599f1b4a7f497e1f1f856fe433d3b7
 docker-init:
  Version:          0.19.0
  GitCommit:        de40ad0
clang version
clang version 7.0.0 (tags/RELEASE_700/final)
jq version
jq-1.6
bats version
Bats 0.4.0
shellcheck version
0.7.2
shfmt version
v3.2.1
ccache version
3.2.4
cmake version
cmake version 3.26.3
heroku version
heroku/8.1.3 linux-x64 node-v16.19.0
imagemagick version
Version: ImageMagick 6.8.9-9 Q16 x86_64 2020-12-04 http://www.imagemagick.org
md5deep version
4.4
mercurial version
version 5.9.3
mysql version
mysql  Ver 14.14 Distrib 5.7.33, for Linux (x86_64) using  EditLine wrapper
openssl version
OpenSSL 1.0.2g  1 Mar 2016
packer version
1.7.5
postgresql client version
psql (PostgreSQL) 10.17 (Ubuntu 10.17-1.pgdg16.04+1)
ragel version
Ragel State Machine Compiler version 6.8 Feb 2013
sudo version
1.8.16
gzip version
gzip 1.6
zip version
Zip 3.0
vim version
VIM - Vi IMproved 7.4 (2013 Aug 10, compiled Oct 13 2020 16:04:38)
iptables version
iptables v1.6.0
curl version
curl 7.47.0 (x86_64-pc-linux-gnu) libcurl/7.47.0 GnuTLS/3.4.10 zlib/1.2.8 libidn/1.32 librtmp/2.3
wget version
GNU Wget 1.17.1 built on linux-gnu.
rsync version
rsync  version 3.1.1  protocol version 31
gimme version
v1.5.4
nvm version
0.39.3
perlbrew version
/home/travis/perl5/perlbrew/bin/perlbrew  - App::perlbrew/0.95
phpenv version
rbenv 1.2.0
rvm version
rvm 1.29.12 (latest) by Michal Papis, Piotr Kuczynski, Wayne E. Seguin [https://rvm.io]
default ruby version
ruby 2.7.6p219 (2022-04-12 revision c9c2245c0a) [x86_64-linux]
default python version
Python 3.7.13
CouchDB version
couchdb 1.6.1
ElasticSearch version
7.16.3
Installed Firefox version
firefox 63.0.1
MongoDB version
MongoDB 4.4.21
PhantomJS version
2.1.1
Pre-installed PostgreSQL versions
9.4.26
9.5.25
9.6.22
Redis version
redis-server 6.0.6
Pre-installed Go versions
1.18.4
ant version
Apache Ant(TM) version 1.9.6 compiled on July 20 2018
mvn version
Apache Maven 3.8.8 (4c87b05d9aedce574290d1acc98575ed5eb6cd39)
gradle version
Gradle 7.5.1!
lein version
Leiningen 2.10.0 on Java 11.0.15.1 OpenJDK 64-Bit Server VM
Pre-installed Node.js versions
v10.24.1
v12.22.12
v14.21.3
v16.15
v16.16.0
v16.20.0
v18.16.0
v4.9.1
v6.17.1
v8.17.0
phpenv versions
  system
  7.4
* 7.4.30 (set by /home/travis/.phpenv/version)
  hhvm-stable
  hhvm
composer --version
Composer version 2.3.7 2022-06-06 16:43:28
Pre-installed Ruby versions
ruby-2.7.6
ruby-3.0.4
ruby-3.1.2
travis_fold:end:system_info

travis_time:end:2b438713:start=1718805549630908622,finish=1718805549638575683,duration=7667061,event=show_system_info
travis_time:start:03124350
travis_time:end:03124350:start=1718805549641609523,finish=1718805549656466846,duration=14857323,event=rm_riak_source
travis_time:start:0f46e0c9
travis_time:end:0f46e0c9:start=1718805549659530126,finish=1718805549665363359,duration=5833233,event=fix_rwky_redis
travis_time:start:110ec10f
travis_time:end:110ec10f:start=1718805549668857380,finish=1718805550501005333,duration=832147953,event=wait_for_network
travis_time:start:04862f6a
travis_time:end:04862f6a:start=1718805550506424847,finish=1718805574828962412,duration=24322537565,event=update_apt_keys
travis_time:start:3792084c
travis_time:end:3792084c:start=1718805574832726929,finish=1718805574886481682,duration=53754753,event=fix_hhvm_source
travis_time:start:096d8b27
travis_time:end:096d8b27:start=1718805574891119159,finish=1718805574894866747,duration=3747588,event=update_mongo_arch
travis_time:start:0f8cc7da
travis_time:end:0f8cc7da:start=1718805574901609402,finish=1718805574943892110,duration=42282708,event=fix_sudo_enabled_trusty
travis_time:start:028dd7c0
travis_time:end:028dd7c0:start=1718805574949391877,finish=1718805574952671438,duration=3279561,event=update_glibc
travis_time:start:090d3b0c
travis_time:end:090d3b0c:start=1718805574959419362,finish=1718805574989522050,duration=30102688,event=clean_up_path
travis_time:start:1d189a9f
travis_time:end:1d189a9f:start=1718805574995188096,finish=1718805575004592640,duration=9404544,event=fix_resolv_conf
travis_time:start:01e4b6ae
travis_time:end:01e4b6ae:start=1718805575009217015,finish=1718805575018188685,duration=8971670,event=fix_etc_hosts
travis_time:start:0fa257cc
travis_time:end:0fa257cc:start=1718805575022730491,finish=1718805575031535850,duration=8805359,event=fix_mvn_settings_xml
travis_time:start:03994598
travis_time:end:03994598:start=1718805575041572256,finish=1718805575052168550,duration=10596294,event=no_ipv6_localhost
travis_time:start:1b07f542
travis_time:end:1b07f542:start=1718805575055992219,finish=1718805575058344396,duration=2352177,event=fix_etc_mavenrc
travis_time:start:10b38af5
OK
travis_time:end:10b38af5:start=1718805575064370942,finish=1718805575385780595,duration=321409653,event=fix_perforce_key
travis_time:start:10370ce8
travis_time:end:10370ce8:start=1718805575390737414,finish=1718805575394942929,duration=4205515,event=fix_wwdr_certificate
travis_time:start:0f8c2100
travis_time:end:0f8c2100:start=1718805575403432697,finish=1718805575428200844,duration=24768147,event=put_localhost_first
travis_time:start:0d6cfc7a
travis_time:end:0d6cfc7a:start=1718805575433848153,finish=1718805575436904336,duration=3056183,event=home_paths
travis_time:start:0e698887
travis_time:end:0e698887:start=1718805575443865791,finish=1718805575455876091,duration=12010300,event=disable_initramfs
travis_time:start:0489256e
travis_time:end:0489256e:start=1718805575462754088,finish=1718805575726015629,duration=263261541,event=disable_ssh_roaming
travis_time:start:157bf5e2
travis_time:end:157bf5e2:start=1718805575731851385,finish=1718805575734281751,duration=2430366,event=debug_tools
travis_time:start:0aed686c
travis_time:end:0aed686c:start=1718805575740249302,finish=1718805575744409123,duration=4159821,event=uninstall_oclint
travis_time:start:05ce2250
travis_time:end:05ce2250:start=1718805575752979032,finish=1718805575756960270,duration=3981238,event=rvm_use
travis_time:start:02c01adb
travis_time:end:02c01adb:start=1718805575760580361,finish=1718805575768559004,duration=7978643,event=rm_etc_boto_cfg
travis_time:start:0a616914
travis_time:end:0a616914:start=1718805575773650460,finish=1718805575776701784,duration=3051324,event=rm_oraclejdk8_symlink
travis_time:start:00f68be0
travis_time:end:00f68be0:start=1718805575780518321,finish=1718805575869139109,duration=88620788,event=enable_i386
travis_time:start:01a75577
travis_time:end:01a75577:start=1718805575874144939,finish=1718805575878247510,duration=4102571,event=update_rubygems
travis_time:start:07c7f96e
travis_time:end:07c7f96e:start=1718805575882854244,finish=1718805576743489654,duration=860635410,event=ensure_path_components
travis_time:start:074ff76c
travis_time:end:074ff76c:start=1718805576749012633,finish=1718805576751448186,duration=2435553,event=redefine_curl
travis_time:start:1c55e080
travis_time:end:1c55e080:start=1718805576756708268,finish=1718805576860688020,duration=103979752,event=nonblock_pipe
travis_time:start:043de860
travis_time:end:043de860:start=1718805576869973912,finish=1718805591262353779,duration=14392379867,event=apt_get_update
travis_time:start:0a9d02aa
travis_time:end:0a9d02aa:start=1718805591269198560,finish=1718805591272877531,duration=3678971,event=deprecate_xcode_64
travis_time:start:00ad7af0
travis_time:end:00ad7af0:start=1718805591281527062,finish=1718805594753010615,duration=3471483553,event=update_heroku
travis_time:start:02ec229a
travis_time:end:02ec229a:start=1718805594762609999,finish=1718805594766424467,duration=3814468,event=shell_session_update
travis_time:start:00cd8891
travis_fold:start:docker_mtu_and_registry_mirrors
travis_fold:end:docker_mtu_and_registry_mirrors
travis_time:end:00cd8891:start=1718805594775536918,finish=1718805598295365383,duration=3519828465,event=set_docker_mtu_and_registry_mirrors
travis_time:start:02c8a4df
travis_fold:start:resolvconf
travis_fold:end:resolvconf
travis_time:end:02c8a4df:start=1718805598302052844,finish=1718805598370459012,duration=68406168,event=resolvconf
travis_time:start:271bad98
travis_time:end:271bad98:start=1718805598377745960,finish=1718805598503147173,duration=125401213,event=maven_central_mirror
travis_time:start:0fcac124
travis_time:end:0fcac124:start=1718805598509760589,finish=1718805598598850070,duration=89089481,event=maven_https
travis_fold:start:apt
travis_time:start:075d9b1d
$ travis_apt_get_update
travis_time:end:075d9b1d:start=1718805598606590792,finish=1718805606025733167,duration=7419142375,event=prepare
Installing APT Packages
travis_time:start:0091c722
$ sudo -E apt-get -yq --no-install-suggests --no-install-recommends $(travis_apt_get_options) install docker-ce
Reading package lists...
Building dependency tree...
Reading state information...
docker-ce is already the newest version (5:20.10.7~3-0~ubuntu-xenial).
0 upgraded, 0 newly installed, 0 to remove and 23 not upgraded.
travis_time:end:0091c722:start=1718805606031138147,finish=1718805606578757513,duration=547619366,event=prepare
travis_fold:end:apt

travis_fold:start:snap
Installing 2 Snaps
travis_time:start:1153647a
$ sudo snap install core

Ensure prerequisites for "core" are available                                  /
Download snap "core" (16928) from channel "stable"                             -
Download snap "core" (16928) from channel "stable"                             \
Download snap "core" (16928) from channel "stable"                             |
Download snap "core" (16928) from channel "stable"                             /
Download snap "core" (16928) from channel "stable"                             -
Download snap "core" (16928) from channel "stable"                             \
Download snap "core" (16928) from channel "stable"                             |[?25l
Download snap "core" (16928) from channel "stable"             0%     0B/s ages!
Download snap "core" (16928) from channel "stable"             1% 3.38MB/s 32.0s
Download snap "core" (16928) from channel "stable"             4% 15.8MB/s 6.59s
Download snap "core" (16928) from channel "stable"            11% 28.8MB/s 3.38s
Download snap "core" (16928) from channel "stable"            17% 37.1MB/s 2.44s
Download snap "core" (16928) from channel "stable"            23% 41.8MB/s 2.00s
Download snap "core" (16928) from channel "stable"            29% 44.6MB/s 1.73s
Download snap "core" (16928) from channel "stable"            35% 47.0MB/s 1.51s
Download snap "core" (16928) from channel "stable"            41% 49.0MB/s 1.31s
Download snap "core" (16928) from channel "stable"            48% 51.1MB/s 1.12s
Download snap "core" (16928) from channel "stable"            54% 52.4MB/s 964ms
Download snap "core" (16928) from channel "stable"            60% 53.9MB/s 807ms
Download snap "core" (16928) from channel "stable"            66% 54.8MB/s 672ms
Download snap "core" (16928) from channel "stable"            73% 55.9MB/s 533ms
Download snap "core" (16928) from channel "stable"            79% 56.7MB/s 404ms
Download snap "core" (16928) from channel "stable"            85% 57.4MB/s 280ms
Download snap "core" (16928) from channel "stable"            92% 58.4MB/s 146ms
Download snap "core" (16928) from channel "stable"            98% 58.6MB/s  36ms
Download snap "core" (16928) from channel "stable"           100% 56.7MB/s 0.0ns
Download snap "core" (16928) from channel "stable"           100% 53.8MB/s 0.0ns
Download snap "core" (16928) from channel "stable"           100% 51.3MB/s 0.0ns
Fetch and check assertions for snap "core" (16928)                             /
Fetch and check assertions for snap "core" (16928)                             -
Fetch and check assertions for snap "core" (16928)                             \
Fetch and check assertions for snap "core" (16928)                             |
Fetch and check assertions for snap "core" (16928)                             /
Fetch and check assertions for snap "core" (16928)                             -
Fetch and check assertions for snap "core" (16928)                             \
Fetch and check assertions for snap "core" (16928)                             |
Mount snap "core" (16928)                                                      /
Mount snap "core" (16928)                                                      -
Mount snap "core" (16928)                                                      \
Mount snap "core" (16928)                                                      |
Mount snap "core" (16928)                                                      /
Mount snap "core" (16928)                                                      -
Setup snap "core" (16928) security profiles                                    \
Automatically connect eligible plugs and slots of snap "core"                  |
2024-06-19T14:00:12Z INFO Waiting for automatic snapd restart...

Run configure hook of "core" snap if present                                   /
[?25hcore 16-2.61.2 from Canonical* installed
travis_time:end:1153647a:start=1718805606584280938,finish=1718805614915526232,duration=8331245294,event=prepare
travis_time:start:046113d8
$ sudo snap install google-cloud-sdk --classic

Ensure prerequisites for "google-cloud-sdk" are available                      /
Ensure prerequisites for "google-cloud-sdk" are available                      -
Ensure prerequisites for "google-cloud-sdk" are available                      \
Download snap "core20" (2318) from channel "stable"                            |
Download snap "core20" (2318) from channel "stable"                            /
Download snap "core20" (2318) from channel "stable"                            -
Download snap "core20" (2318) from channel "stable"                            \
Download snap "core20" (2318) from channel "stable"                            |
Download snap "core20" (2318) from channel "stable"                            /[?25l
Download snap "core20" (2318) from channel "stable"            0% 1.43MB/s 46.6s
Download snap "core20" (2318) from channel "stable"            2% 7.95MB/s 8.24s
Download snap "core20" (2318) from channel "stable"           11% 24.6MB/s 2.42s
Download snap "core20" (2318) from channel "stable"           21% 35.5MB/s 1.49s
Download snap "core20" (2318) from channel "stable"           32% 42.3MB/s 1.08s
Download snap "core20" (2318) from channel "stable"           42% 46.1MB/s 846ms
Download snap "core20" (2318) from channel "stable"           53% 49.6MB/s 641ms
Download snap "core20" (2318) from channel "stable"           63% 51.8MB/s 484ms
Download snap "core20" (2318) from channel "stable"           73% 53.7MB/s 333ms
Download snap "core20" (2318) from channel "stable"           84% 55.1MB/s 196ms
Download snap "core20" (2318) from channel "stable"           94% 56.0MB/s  75ms
Download snap "core20" (2318) from channel "stable"          100% 54.8MB/s 0.0ns
Download snap "core20" (2318) from channel "stable"          100% 50.6MB/s 0.0ns
Fetch and check assertions for snap "core20" (2318)                            -
Fetch and check assertions for snap "core20" (2318)                            \
Fetch and check assertions for snap "core20" (2318)                            |
Fetch and check assertions for snap "core20" (2318)                            /
Mount snap "core20" (2318)                                                     -
Mount snap "core20" (2318)                                                     \
Mount snap "core20" (2318)                                                     |
Mount snap "core20" (2318)                                                     /
Mount snap "core20" (2318)                                                     -
Download snap "google-cloud-sdk" (460) from channel "stable"                   \
Download snap "google-cloud-sdk" (460) from channel "stable"                   |
Download snap "google-cloud-sdk" (460) from channel "stable"                   /
Download snap "google-cloud-sdk" (460) from channel "stable"                   -
Download snap "google-cloud-sdk" (460) from channel "stable"                   \
Download snap "google-cloud-sdk" (460) from channel "stable"                   |
Download snap "google-cloud-sdk" (460) from channel "stable"                   /
Download snap "google-cloud-sdk" (460) from channel "stable"                   -
Download snap "google-cloud-sdk" (460) from channel "stable"                   \[?25l
Download snap "google-cloud-sdk" (460) from channel "stable"   0%     0B/s ages!
Download snap "google-cloud-sdk" (460) from channel "stable"   0%     0B/s ages!
Download snap "google-cloud-sdk" (460) from channel "stable"   0%     0B/s ages!
Download snap "google-cloud-sdk" (460) from channel "stable"   0%     0B/s ages!
Download snap "google-cloud-sdk" (460) from channel "stable"   0%     0B/s ages!
Download snap "google-cloud-sdk" (460) from channel "stable"   0%     0B/s ages!
Download snap "google-cloud-sdk" (460) from channel "stable"   0%     0B/s ages!
Download snap "google-cloud-sdk" (460) from channel "stable"   0%     0B/s ages!
Download snap "google-cloud-sdk" (460) from channel "stable"   0%  825kB/s 7m28s
Download snap "google-cloud-sdk" (460) from channel "stable"   0%  740kB/s 8m19s
Download snap "google-cloud-sdk" (460) from channel "stable"   0%  673kB/s 9m09s
Download snap "google-cloud-sdk" (460) from channel "stable"   0% 1.23MB/s 4m59s
Download snap "google-cloud-sdk" (460) from channel "stable"   0% 1.14MB/s 5m24s
Download snap "google-cloud-sdk" (460) from channel "stable"   1% 1.59MB/s 3m52s
Download snap "google-cloud-sdk" (460) from channel "stable"   1% 2.47MB/s 2m29s
Download snap "google-cloud-sdk" (460) from channel "stable"   1% 3.24MB/s 1m53s
Download snap "google-cloud-sdk" (460) from channel "stable"   2% 4.79MB/s 1m16s
Download snap "google-cloud-sdk" (460) from channel "stable"   3% 6.17MB/s 58.2s
Download snap "google-cloud-sdk" (460) from channel "stable"   4% 7.01MB/s 50.9s
Download snap "google-cloud-sdk" (460) from channel "stable"   4% 7.77MB/s 45.6s
Download snap "google-cloud-sdk" (460) from channel "stable"   5% 8.81MB/s 39.9s
Download snap "google-cloud-sdk" (460) from channel "stable"   6% 9.42MB/s 37.1s
Download snap "google-cloud-sdk" (460) from channel "stable"   6% 10.0MB/s 34.8s
Download snap "google-cloud-sdk" (460) from channel "stable"   7% 10.8MB/s 31.9s
Download snap "google-cloud-sdk" (460) from channel "stable"   8% 11.0MB/s 31.3s
Download snap "google-cloud-sdk" (460) from channel "stable"   8% 11.7MB/s 29.1s
Download snap "google-cloud-sdk" (460) from channel "stable"   9% 12.3MB/s 27.3s
Download snap "google-cloud-sdk" (460) from channel "stable"  10% 13.0MB/s 25.7s
Download snap "google-cloud-sdk" (460) from channel "stable"  11% 13.3MB/s 25.0s
Download snap "google-cloud-sdk" (460) from channel "stable"  11% 13.8MB/s 23.7s
Download snap "google-cloud-sdk" (460) from channel "stable"  12% 14.1MB/s 23.1s
Download snap "google-cloud-sdk" (460) from channel "stable"  13% 14.3MB/s 22.6s
Download snap "google-cloud-sdk" (460) from channel "stable"  13% 14.6MB/s 22.0s
Download snap "google-cloud-sdk" (460) from channel "stable"  14% 15.0MB/s 21.2s
Download snap "google-cloud-sdk" (460) from channel "stable"  15% 15.2MB/s 20.8s
Download snap "google-cloud-sdk" (460) from channel "stable"  15% 15.4MB/s 20.4s
Download snap "google-cloud-sdk" (460) from channel "stable"  16% 15.8MB/s 19.7s
Download snap "google-cloud-sdk" (460) from channel "stable"  17% 16.2MB/s 19.0s
Download snap "google-cloud-sdk" (460) from channel "stable"  17% 16.3MB/s 18.7s
Download snap "google-cloud-sdk" (460) from channel "stable"  18% 16.7MB/s 18.2s
Download snap "google-cloud-sdk" (460) from channel "stable"  19% 17.0MB/s 17.7s
Download snap "google-cloud-sdk" (460) from channel "stable"  20% 17.1MB/s 17.4s
Download snap "google-cloud-sdk" (460) from channel "stable"  20% 17.2MB/s 17.1s
Download snap "google-cloud-sdk" (460) from channel "stable"  21% 17.3MB/s 16.9s
Download snap "google-cloud-sdk" (460) from channel "stable"  21% 17.4MB/s 16.7s
Download snap "google-cloud-sdk" (460) from channel "stable"  22% 17.5MB/s 16.4s
Download snap "google-cloud-sdk" (460) from channel "stable"  23% 17.8MB/s 16.0s
Download snap "google-cloud-sdk" (460) from channel "stable"  24% 18.0MB/s 15.6s
Download snap "google-cloud-sdk" (460) from channel "stable"  25% 18.3MB/s 15.3s
Download snap "google-cloud-sdk" (460) from channel "stable"  25% 18.4MB/s 15.1s
Download snap "google-cloud-sdk" (460) from channel "stable"  26% 18.6MB/s 14.8s
Download snap "google-cloud-sdk" (460) from channel "stable"  27% 18.7MB/s 14.6s
Download snap "google-cloud-sdk" (460) from channel "stable"  27% 18.7MB/s 14.4s
Download snap "google-cloud-sdk" (460) from channel "stable"  28% 18.9MB/s 14.1s
Download snap "google-cloud-sdk" (460) from channel "stable"  29% 19.0MB/s 13.9s
Download snap "google-cloud-sdk" (460) from channel "stable"  29% 19.0MB/s 13.8s
Download snap "google-cloud-sdk" (460) from channel "stable"  30% 19.1MB/s 13.6s
Download snap "google-cloud-sdk" (460) from channel "stable"  31% 19.3MB/s 13.3s
Download snap "google-cloud-sdk" (460) from channel "stable"  31% 19.3MB/s 13.2s
Download snap "google-cloud-sdk" (460) from channel "stable"  32% 19.5MB/s 12.9s
Download snap "google-cloud-sdk" (460) from channel "stable"  33% 19.7MB/s 12.6s
Download snap "google-cloud-sdk" (460) from channel "stable"  34% 19.8MB/s 12.4s
Download snap "google-cloud-sdk" (460) from channel "stable"  34% 19.9MB/s 12.3s
Download snap "google-cloud-sdk" (460) from channel "stable"  35% 19.9MB/s 12.1s
Download snap "google-cloud-sdk" (460) from channel "stable"  35% 19.9MB/s 12.0s
Download snap "google-cloud-sdk" (460) from channel "stable"  36% 20.0MB/s 11.9s
Download snap "google-cloud-sdk" (460) from channel "stable"  37% 20.0MB/s 11.7s
Download snap "google-cloud-sdk" (460) from channel "stable"  37% 20.0MB/s 11.6s
Download snap "google-cloud-sdk" (460) from channel "stable"  38% 20.2MB/s 11.4s
Download snap "google-cloud-sdk" (460) from channel "stable"  39% 20.3MB/s 11.1s
Download snap "google-cloud-sdk" (460) from channel "stable"  40% 20.4MB/s 10.9s
Download snap "google-cloud-sdk" (460) from channel "stable"  40% 20.5MB/s 10.8s
Download snap "google-cloud-sdk" (460) from channel "stable"  41% 20.6MB/s 10.6s
Download snap "google-cloud-sdk" (460) from channel "stable"  42% 20.6MB/s 10.5s
Download snap "google-cloud-sdk" (460) from channel "stable"  43% 20.7MB/s 10.3s
Download snap "google-cloud-sdk" (460) from channel "stable"  43% 20.7MB/s 10.1s
Download snap "google-cloud-sdk" (460) from channel "stable"  44% 20.8MB/s 10.0s
Download snap "google-cloud-sdk" (460) from channel "stable"  44% 20.8MB/s 9.90s
Download snap "google-cloud-sdk" (460) from channel "stable"  45% 20.8MB/s 9.79s
Download snap "google-cloud-sdk" (460) from channel "stable"  46% 20.9MB/s 9.59s
Download snap "google-cloud-sdk" (460) from channel "stable"  47% 21.0MB/s 9.40s
Download snap "google-cloud-sdk" (460) from channel "stable"  47% 21.0MB/s 9.29s
Download snap "google-cloud-sdk" (460) from channel "stable"  48% 21.1MB/s 9.10s
Download snap "google-cloud-sdk" (460) from channel "stable"  49% 21.2MB/s 8.91s
Download snap "google-cloud-sdk" (460) from channel "stable"  49% 21.3MB/s 8.80s
Download snap "google-cloud-sdk" (460) from channel "stable"  50% 21.4MB/s 8.62s
Download snap "google-cloud-sdk" (460) from channel "stable"  51% 21.4MB/s 8.51s
Download snap "google-cloud-sdk" (460) from channel "stable"  51% 21.4MB/s 8.40s
Download snap "google-cloud-sdk" (460) from channel "stable"  52% 21.4MB/s 8.29s
Download snap "google-cloud-sdk" (460) from channel "stable"  53% 21.4MB/s 8.19s
Download snap "google-cloud-sdk" (460) from channel "stable"  54% 21.5MB/s 8.01s
Download snap "google-cloud-sdk" (460) from channel "stable"  54% 21.6MB/s 7.84s
Download snap "google-cloud-sdk" (460) from channel "stable"  55% 21.6MB/s 7.73s
Download snap "google-cloud-sdk" (460) from channel "stable"  56% 21.7MB/s 7.56s
Download snap "google-cloud-sdk" (460) from channel "stable"  57% 21.7MB/s 7.40s
Download snap "google-cloud-sdk" (460) from channel "stable"  57% 21.7MB/s 7.35s
Download snap "google-cloud-sdk" (460) from channel "stable"  58% 21.8MB/s 7.19s
Download snap "google-cloud-sdk" (460) from channel "stable"  58% 21.8MB/s 7.08s
Download snap "google-cloud-sdk" (460) from channel "stable"  59% 21.8MB/s 6.92s
Download snap "google-cloud-sdk" (460) from channel "stable"  60% 21.8MB/s 6.81s
Download snap "google-cloud-sdk" (460) from channel "stable"  60% 21.8MB/s 6.71s
Download snap "google-cloud-sdk" (460) from channel "stable"  61% 21.9MB/s 6.55s
Download snap "google-cloud-sdk" (460) from channel "stable"  62% 22.0MB/s 6.39s
Download snap "google-cloud-sdk" (460) from channel "stable"  63% 22.1MB/s 6.23s
Download snap "google-cloud-sdk" (460) from channel "stable"  63% 22.1MB/s 6.13s
Download snap "google-cloud-sdk" (460) from channel "stable"  64% 22.1MB/s 6.03s
Download snap "google-cloud-sdk" (460) from channel "stable"  65% 22.1MB/s 5.93s
Download snap "google-cloud-sdk" (460) from channel "stable"  65% 22.1MB/s 5.77s
Download snap "google-cloud-sdk" (460) from channel "stable"  66% 22.1MB/s 5.67s
Download snap "google-cloud-sdk" (460) from channel "stable"  67% 22.1MB/s 5.57s
Download snap "google-cloud-sdk" (460) from channel "stable"  67% 22.1MB/s 5.47s
Download snap "google-cloud-sdk" (460) from channel "stable"  68% 22.2MB/s 5.31s
Download snap "google-cloud-sdk" (460) from channel "stable"  69% 22.3MB/s 5.16s
Download snap "google-cloud-sdk" (460) from channel "stable"  70% 22.3MB/s 5.06s
Download snap "google-cloud-sdk" (460) from channel "stable"  70% 22.3MB/s 4.91s
Download snap "google-cloud-sdk" (460) from channel "stable"  71% 22.4MB/s 4.77s
Download snap "google-cloud-sdk" (460) from channel "stable"  72% 22.4MB/s 4.67s
Download snap "google-cloud-sdk" (460) from channel "stable"  72% 22.4MB/s 4.57s
Download snap "google-cloud-sdk" (460) from channel "stable"  73% 22.4MB/s 4.47s
Download snap "google-cloud-sdk" (460) from channel "stable"  74% 22.5MB/s 4.32s
Download snap "google-cloud-sdk" (460) from channel "stable"  74% 22.5MB/s 4.22s
Download snap "google-cloud-sdk" (460) from channel "stable"  75% 22.5MB/s 4.12s
Download snap "google-cloud-sdk" (460) from channel "stable"  76% 22.5MB/s 3.98s
Download snap "google-cloud-sdk" (460) from channel "stable"  76% 22.5MB/s 3.88s
Download snap "google-cloud-sdk" (460) from channel "stable"  77% 22.6MB/s 3.73s
Download snap "google-cloud-sdk" (460) from channel "stable"  78% 22.6MB/s 3.59s
Download snap "google-cloud-sdk" (460) from channel "stable"  79% 22.7MB/s 3.45s
Download snap "google-cloud-sdk" (460) from channel "stable"  79% 22.7MB/s 3.35s
Download snap "google-cloud-sdk" (460) from channel "stable"  80% 22.7MB/s 3.26s
Download snap "google-cloud-sdk" (460) from channel "stable"  81% 22.7MB/s 3.16s
Download snap "google-cloud-sdk" (460) from channel "stable"  81% 22.6MB/s 3.06s
Download snap "google-cloud-sdk" (460) from channel "stable"  82% 22.7MB/s 2.92s
Download snap "google-cloud-sdk" (460) from channel "stable"  83% 22.7MB/s 2.82s
Download snap "google-cloud-sdk" (460) from channel "stable"  84% 22.8MB/s 2.68s
Download snap "google-cloud-sdk" (460) from channel "stable"  84% 22.7MB/s 2.58s
Download snap "google-cloud-sdk" (460) from channel "stable"  85% 22.8MB/s 2.44s
Download snap "google-cloud-sdk" (460) from channel "stable"  86% 22.8MB/s 2.31s
Download snap "google-cloud-sdk" (460) from channel "stable"  86% 22.8MB/s 2.21s
Download snap "google-cloud-sdk" (460) from channel "stable"  87% 22.9MB/s 2.07s
Download snap "google-cloud-sdk" (460) from channel "stable"  88% 22.9MB/s 1.98s
Download snap "google-cloud-sdk" (460) from channel "stable"  88% 22.9MB/s 1.88s
Download snap "google-cloud-sdk" (460) from channel "stable"  89% 22.9MB/s 1.78s
Download snap "google-cloud-sdk" (460) from channel "stable"  90% 22.9MB/s 1.68s
Download snap "google-cloud-sdk" (460) from channel "stable"  90% 22.9MB/s 1.55s
Download snap "google-cloud-sdk" (460) from channel "stable"  91% 23.0MB/s 1.41s
Download snap "google-cloud-sdk" (460) from channel "stable"  92% 23.0MB/s 1.32s
Download snap "google-cloud-sdk" (460) from channel "stable"  93% 23.0MB/s 1.18s
Download snap "google-cloud-sdk" (460) from channel "stable"  93% 23.0MB/s 1.05s
Download snap "google-cloud-sdk" (460) from channel "stable"  94% 23.0MB/s 953ms
Download snap "google-cloud-sdk" (460) from channel "stable"  95% 23.0MB/s 855ms
Download snap "google-cloud-sdk" (460) from channel "stable"  95% 23.0MB/s 758ms
Download snap "google-cloud-sdk" (460) from channel "stable"  96% 23.0MB/s 660ms
Download snap "google-cloud-sdk" (460) from channel "stable"  97% 23.0MB/s 562ms
Download snap "google-cloud-sdk" (460) from channel "stable"  97% 23.1MB/s 431ms
Download snap "google-cloud-sdk" (460) from channel "stable"  98% 23.1MB/s 334ms
Download snap "google-cloud-sdk" (460) from channel "stable"  99% 23.1MB/s 203ms
Download snap "google-cloud-sdk" (460) from channel "stable" 100% 23.1MB/s  73ms
Download snap "google-cloud-sdk" (460) from channel "stable" 100% 23.1MB/s 0.0ns
Download snap "google-cloud-sdk" (460) from channel "stable" 100% 23.0MB/s 0.0ns
Download snap "google-cloud-sdk" (460) from channel "stable" 100% 22.8MB/s 0.0ns
Download snap "google-cloud-sdk" (460) from channel "stable" 100% 22.7MB/s 0.0ns
Download snap "google-cloud-sdk" (460) from channel "stable" 100% 22.5MB/s 0.0ns
Download snap "google-cloud-sdk" (460) from channel "stable" 100% 22.4MB/s 0.0ns
Download snap "google-cloud-sdk" (460) from channel "stable" 100% 22.3MB/s 0.0ns
Download snap "google-cloud-sdk" (460) from channel "stable" 100% 22.1MB/s 0.0ns
Download snap "google-cloud-sdk" (460) from channel "stable" 100% 22.0MB/s 0.0ns
Download snap "google-cloud-sdk" (460) from channel "stable" 100% 21.9MB/s 0.0ns
Download snap "google-cloud-sdk" (460) from channel "stable" 100% 21.7MB/s 0.0ns
Download snap "google-cloud-sdk" (460) from channel "stable" 100% 21.6MB/s 0.0ns
Download snap "google-cloud-sdk" (460) from channel "stable" 100% 21.5MB/s 0.0ns
Download snap "google-cloud-sdk" (460) from channel "stable" 100% 21.3MB/s 0.0ns
Fetch and check assertions for snap "google-cloud-sdk" (460)                   |
Fetch and check assertions for snap "google-cloud-sdk" (460)                   /
Fetch and check assertions for snap "google-cloud-sdk" (460)                   -
Fetch and check assertions for snap "google-cloud-sdk" (460)                   \
Fetch and check assertions for snap "google-cloud-sdk" (460)                   |
Fetch and check assertions for snap "google-cloud-sdk" (460)                   /
Fetch and check assertions for snap "google-cloud-sdk" (460)                   -
Fetch and check assertions for snap "google-cloud-sdk" (460)                   \
Mount snap "google-cloud-sdk" (460)                                            |
Mount snap "google-cloud-sdk" (460)                                            /
Mount snap "google-cloud-sdk" (460)                                            -
Mount snap "google-cloud-sdk" (460)                                            \
Mount snap "google-cloud-sdk" (460)                                            |
Mount snap "google-cloud-sdk" (460)                                            /
Mount snap "google-cloud-sdk" (460)                                            -
Mount snap "google-cloud-sdk" (460)                                            \
Mount snap "google-cloud-sdk" (460)                                            |
Mount snap "google-cloud-sdk" (460)                                            /
Mount snap "google-cloud-sdk" (460)                                            -
Mount snap "google-cloud-sdk" (460)                                            \
Mount snap "google-cloud-sdk" (460)                                            |
Mount snap "google-cloud-sdk" (460)                                            /
Mount snap "google-cloud-sdk" (460)                                            -
Mount snap "google-cloud-sdk" (460)                                            \
Mount snap "google-cloud-sdk" (460)                                            |
Mount snap "google-cloud-sdk" (460)                                            /
Mount snap "google-cloud-sdk" (460)                                            -
Mount snap "google-cloud-sdk" (460)                                            \
Mount snap "google-cloud-sdk" (460)                                            |
Mount snap "google-cloud-sdk" (460)                                            /
Make snap "google-cloud-sdk" (460) available to the system                     -
Run health check of "google-cloud-sdk" snap                                    \
[?25hgoogle-cloud-sdk 481.0.0 from Cloud SDK (google-cloud-sdk**) installed
travis_time:end:046113d8:start=1718805614920752862,finish=1718805643281541808,duration=28360788946,event=prepare
travis_time:start:1f8ac44f
$ sudo snap install vault

Ensure prerequisites for "vault" are available                                 /
Ensure prerequisites for "vault" are available                                 -
Ensure prerequisites for "vault" are available                                 \
Download snap "core22" (1380) from channel "stable"                            |
Download snap "core22" (1380) from channel "stable"                            /
Download snap "core22" (1380) from channel "stable"                            -
Download snap "core22" (1380) from channel "stable"                            \
Download snap "core22" (1380) from channel "stable"                            |
Download snap "core22" (1380) from channel "stable"                            /
Download snap "core22" (1380) from channel "stable"                            -
Download snap "core22" (1380) from channel "stable"                            \[?25l
Download snap "core22" (1380) from channel "stable"            0%     0B/s ages!
Download snap "core22" (1380) from channel "stable"            0%     0B/s ages!
Download snap "core22" (1380) from channel "stable"            0%     0B/s ages!
Download snap "core22" (1380) from channel "stable"            0%  401kB/s 3m14s
Download snap "core22" (1380) from channel "stable"            0%  643kB/s 2m01s
Download snap "core22" (1380) from channel "stable"            1% 1.34MB/s 57.4s
Download snap "core22" (1380) from channel "stable"            2% 2.07MB/s 36.9s
Download snap "core22" (1380) from channel "stable"            4% 3.62MB/s 20.7s
Download snap "core22" (1380) from channel "stable"            7% 5.91MB/s 12.3s
Download snap "core22" (1380) from channel "stable"           10% 7.89MB/s 8.85s
Download snap "core22" (1380) from channel "stable"           13% 9.37MB/s 7.19s
Download snap "core22" (1380) from channel "stable"           17% 10.9MB/s 5.94s
Download snap "core22" (1380) from channel "stable"           20% 11.8MB/s 5.30s
Download snap "core22" (1380) from channel "stable"           23% 12.8MB/s 4.68s
Download snap "core22" (1380) from channel "stable"           27% 13.6MB/s 4.19s
Download snap "core22" (1380) from channel "stable"           30% 14.2MB/s 3.86s
Download snap "core22" (1380) from channel "stable"           33% 14.9MB/s 3.51s
Download snap "core22" (1380) from channel "stable"           37% 15.7MB/s 3.15s
Download snap "core22" (1380) from channel "stable"           40% 16.0MB/s 2.93s
Download snap "core22" (1380) from channel "stable"           43% 16.7MB/s 2.64s
Download snap "core22" (1380) from channel "stable"           47% 17.1MB/s 2.42s
Download snap "core22" (1380) from channel "stable"           50% 17.4MB/s 2.24s
Download snap "core22" (1380) from channel "stable"           53% 17.8MB/s 2.05s
Download snap "core22" (1380) from channel "stable"           56% 18.1MB/s 1.88s
Download snap "core22" (1380) from channel "stable"           59% 18.2MB/s 1.74s
Download snap "core22" (1380) from channel "stable"           63% 18.5MB/s 1.57s
Download snap "core22" (1380) from channel "stable"           66% 18.8MB/s 1.41s
Download snap "core22" (1380) from channel "stable"           70% 19.2MB/s 1.23s
Download snap "core22" (1380) from channel "stable"           73% 19.3MB/s 1.09s
Download snap "core22" (1380) from channel "stable"           77% 19.6MB/s 933ms
Download snap "core22" (1380) from channel "stable"           80% 19.8MB/s 791ms
Download snap "core22" (1380) from channel "stable"           83% 20.0MB/s 653ms
Download snap "core22" (1380) from channel "stable"           86% 20.1MB/s 528ms
Download snap "core22" (1380) from channel "stable"           89% 20.2MB/s 412ms
Download snap "core22" (1380) from channel "stable"           92% 20.2MB/s 298ms
Download snap "core22" (1380) from channel "stable"           96% 20.4MB/s 160ms
Download snap "core22" (1380) from channel "stable"           99% 20.5MB/s  48ms
Download snap "core22" (1380) from channel "stable"          100% 20.2MB/s 0.0ns
Download snap "core22" (1380) from channel "stable"          100% 19.7MB/s 0.0ns
Fetch and check assertions for snap "core22" (1380)                            |
Fetch and check assertions for snap "core22" (1380)                            /
Fetch and check assertions for snap "core22" (1380)                            -
Fetch and check assertions for snap "core22" (1380)                            \
Fetch and check assertions for snap "core22" (1380)                            |
Fetch and check assertions for snap "core22" (1380)                            /
Mount snap "core22" (1380)                                                     -
Mount snap "core22" (1380)                                                     \
Mount snap "core22" (1380)                                                     |
Mount snap "core22" (1380)                                                     /
Mount snap "core22" (1380)                                                     -
Mount snap "core22" (1380)                                                     \
Download snap "vault" (2275) from channel "1.16/stable"                        |
Download snap "vault" (2275) from channel "1.16/stable"                        /
Download snap "vault" (2275) from channel "1.16/stable"                        -
Download snap "vault" (2275) from channel "1.16/stable"                        \
Download snap "vault" (2275) from channel "1.16/stable"                        |
Download snap "vault" (2275) from channel "1.16/stable"                        /[?25l
Download snap "vault" (2275) from channel "1.16/stable"        0%     0B/s ages!
Download snap "vault" (2275) from channel "1.16/stable"        0% 4.01MB/s 48.6s
Download snap "vault" (2275) from channel "1.16/stable"        1% 8.04MB/s 24.1s
Download snap "vault" (2275) from channel "1.16/stable"        3% 13.1MB/s 14.6s
Download snap "vault" (2275) from channel "1.16/stable"        5% 18.5MB/s 10.1s
Download snap "vault" (2275) from channel "1.16/stable"        9% 28.0MB/s 6.40s
Download snap "vault" (2275) from channel "1.16/stable"       12% 33.7MB/s 5.11s
Download snap "vault" (2275) from channel "1.16/stable"       16% 39.0MB/s 4.21s
Download snap "vault" (2275) from channel "1.16/stable"       20% 42.0MB/s 3.74s
Download snap "vault" (2275) from channel "1.16/stable"       24% 45.0MB/s 3.33s
Download snap "vault" (2275) from channel "1.16/stable"       27% 47.9MB/s 2.97s
Download snap "vault" (2275) from channel "1.16/stable"       31% 49.2MB/s 2.75s
Download snap "vault" (2275) from channel "1.16/stable"       35% 51.6MB/s 2.47s
Download snap "vault" (2275) from channel "1.16/stable"       38% 52.5MB/s 2.30s
Download snap "vault" (2275) from channel "1.16/stable"       42% 54.3MB/s 2.08s
Download snap "vault" (2275) from channel "1.16/stable"       46% 55.3MB/s 1.91s
Download snap "vault" (2275) from channel "1.16/stable"       50% 56.0MB/s 1.76s
Download snap "vault" (2275) from channel "1.16/stable"       53% 56.5MB/s 1.63s
Download snap "vault" (2275) from channel "1.16/stable"       57% 57.5MB/s 1.46s
Download snap "vault" (2275) from channel "1.16/stable"       61% 58.0MB/s 1.33s
Download snap "vault" (2275) from channel "1.16/stable"       64% 58.5MB/s 1.20s
Download snap "vault" (2275) from channel "1.16/stable"       68% 59.5MB/s 1.04s
Download snap "vault" (2275) from channel "1.16/stable"       72% 59.5MB/s 934ms
Download snap "vault" (2275) from channel "1.16/stable"       75% 59.6MB/s 831ms
Download snap "vault" (2275) from channel "1.16/stable"       79% 60.2MB/s 693ms
Download snap "vault" (2275) from channel "1.16/stable"       82% 60.5MB/s 576ms
Download snap "vault" (2275) from channel "1.16/stable"       86% 60.7MB/s 459ms
Download snap "vault" (2275) from channel "1.16/stable"       90% 61.4MB/s 321ms
Download snap "vault" (2275) from channel "1.16/stable"       93% 61.5MB/s 215ms
Download snap "vault" (2275) from channel "1.16/stable"       97% 61.7MB/s 101ms
Download snap "vault" (2275) from channel "1.16/stable"      100% 61.7MB/s 0.0ns
Download snap "vault" (2275) from channel "1.16/stable"      100% 59.8MB/s 0.0ns
Download snap "vault" (2275) from channel "1.16/stable"      100% 58.0MB/s 0.0ns
Download snap "vault" (2275) from channel "1.16/stable"      100% 56.3MB/s 0.0ns
Download snap "vault" (2275) from channel "1.16/stable"      100% 54.7MB/s 0.0ns
Download snap "vault" (2275) from channel "1.16/stable"      100% 53.2MB/s 0.0ns
Download snap "vault" (2275) from channel "1.16/stable"      100% 51.8MB/s 0.0ns
Fetch and check assertions for snap "vault" (2275)                             -
Fetch and check assertions for snap "vault" (2275)                             \
Fetch and check assertions for snap "vault" (2275)                             |
Fetch and check assertions for snap "vault" (2275)                             /
Fetch and check assertions for snap "vault" (2275)                             -
Fetch and check assertions for snap "vault" (2275)                             \
Mount snap "vault" (2275)                                                      |
Setup snap "vault" (2275) security profiles for auto-connections               /
Run install hook of "vault" snap if present                                    -
Run install hook of "vault" snap if present                                    \
Run install hook of "vault" snap if present                                    |
Run install hook of "vault" snap if present                                    /
Run install hook of "vault" snap if present                                    -
Run configure hook of "vault" snap if present                                  \
[?25hvault (1.16/stable) 1.16.2 from Canonical** installed
travis_time:end:1f8ac44f:start=1718805643292115295,finish=1718805657920527740,duration=14628412445,event=prepare
travis_time:start:02909335
$ sudo snap list
Name              Version    Rev    Tracking       Publisher           Notes
core              16-2.61.2  16928  latest/stable  canonical**         core
core20            20240416   2318   latest/stable  canonical**         base
core22            20240408   1380   latest/stable  canonical**         base
google-cloud-sdk  481.0.0    460    latest/stable  google-cloud-sdk**  classic
vault             1.16.2     2275   1.16/stable    canonical**         -
travis_time:end:02909335:start=1718805657925788253,finish=1718805657973851677,duration=48063424,event=prepare
travis_fold:end:snap

travis_time:start:120bddb4
travis_fold:start:services
travis_time:start:0cf94122
$ sudo systemctl start rabbitmq-server
Failed to start rabbitmq-server.service: Unit rabbitmq-server.service not found.
travis_time:end:0cf94122:start=1718805657983998847,finish=1718805657997152793,duration=13153946,event=prepare
travis_time:start:00148a76
$ sudo systemctl start docker
travis_time:end:00148a76:start=1718805658002147641,finish=1718805658014154957,duration=12007316,event=prepare
travis_time:start:0d4409f0
$ sudo systemctl start redis-server
travis_time:end:0d4409f0:start=1718805658020605253,finish=1718805658099194502,duration=78589249,event=prepare
travis_fold:end:services
travis_time:end:0d4409f0:start=1718805658020605253,finish=1718805661105370727,duration=3084765474,event=services
travis_time:start:09460671
travis_time:end:09460671:start=1718805661110745398,finish=1718805661113231790,duration=2486392,event=fix_ps4
Updating gimme
travis_time:start:09b45cd0

travis_fold:start:git.checkout
travis_time:start:10edcd90
travis_time:end:10edcd90:start=1718805666786452190,finish=1718805666791764684,duration=5312494,event=checkout
travis_time:start:06c6505e
$ git clone --depth=10 --branch=kw-updated_worker https://github.com/travis-ci/worker.git travis-ci/worker
Cloning into 'travis-ci/worker'...
travis_time:end:06c6505e:start=1718805666796076558,finish=1718805667444040382,duration=647963824,event=checkout
$ cd travis-ci/worker
$ git checkout -qf c035498feb2a1ce730637951f5598fd7117f062b
travis_fold:end:git.checkout

travis_time:end:06c6505e:start=1718805666796076558,finish=1718805667461415700,duration=665339142,event=checkout
$ travis_export_go 1.17.x github.com/travis-ci/worker
travis_time:start:01e69e0a

Setting environment variables from repository settings
$ export ARTIFACTS_PATHS=./build
$ export ARTIFACTS_BUCKET=travis-worker-artifacts
$ export ARTIFACTS_PERMISSIONS=public-read
$ export ARTIFACTS_KEY=[secure]
$ export ARTIFACTS_SECRET=[secure]
$ export PACKAGECLOUD_TOKEN=[secure]
$ export DOCKER_HUB_TRIGGER_URL=[secure]
$ export DOCKER_LOGIN_USERNAME=[secure]
$ export DOCKER_LOGIN_PASSWORD=[secure]
$ export VAULT_PASS=[secure]
$ export GCE_PROJECT=[secure]
$ export VAULT_USERNAME=[secure]
$ export VAULT_ADDR=[secure]
$ export CLOUDSDK_CORE_DISABLE_PROMPTS=[secure]

Setting environment variables from .travis.yml
$ export AMQP_URI="amqp://"
$ export GOPATH="$HOME/gopath"
$ export PATH="bin:$HOME/gopath/bin:$HOME/bin:$PATH"
$ export CHECKOUT_ROOT="$HOME/gopath/src/github.com/travis-ci/worker"
$ export GO15VENDOREXPERIMENT='1'
$ export REDIS_URL="redis://"

travis_time:end:01e69e0a:start=1718805667469068861,finish=1718805667485820984,duration=16752123,event=env
travis_time:start:1e33125f
$ travis_setup_go
go version go1.17.13 linux/amd64
$ export GOPATH="/home/travis/gopath"
$ export PATH="/home/travis/gopath/bin:/home/travis/.gimme/versions/go1.17.13.linux.amd64/bin:bin:/home/travis/gopath/bin:/home/travis/bin:/home/travis/bin:/home/travis/bin:/home/travis/.local/bin:/usr/local/lib/jvm/openjdk11/bin:/opt/pyenv/shims:/home/travis/.phpenv/shims:/home/travis/perl5/perlbrew/bin:/home/travis/perl5/perlbrew/perls/5.34.1/bin:/home/travis/.nvm/versions/node/v16.16.0/bin:/home/travis/.rvm/gems/ruby-2.7.6/bin:/home/travis/.rvm/gems/ruby-2.7.6@global/bin:/home/travis/.rvm/rubies/ruby-2.7.6/bin:/home/travis/gopath/bin:/home/travis/.gimme/versions/go1.18.4.linux.amd64/bin:/usr/local/maven-3.8.8/bin:/usr/local/cmake-3.26.3/bin:/usr/local/clang-7.0.0/bin:/usr/local/sbin:/usr/local/bin:/usr/sbin:/usr/bin:/sbin:/bin:/snap/bin:/home/travis/.rvm/bin:/home/travis/.phpenv/bin:/opt/pyenv/bin:/home/travis/.yarn/bin"
$ export GO111MODULE="auto"
travis_time:end:1e33125f:start=1718805667493596011,finish=1718805673360402279,duration=5866806268,event=
travis_fold:start:cache.1
Setting up build cache
$ export CASHER_DIR=${TRAVIS_HOME}/.casher
travis_time:start:025d8fc0
$ Installing caching utilities
travis_time:end:025d8fc0:start=1718805674209223233,finish=1718805674470473459,duration=261250226,event=setup_casher
travis_time:start:09165421
travis_time:end:09165421:start=1718805674478265992,finish=1718805674481400169,duration=3134177,event=setup_casher
travis_time:start:2f12e9f6
attempting to download cache archive
fetching kw-updated_worker/cache--linux-xenial-8e66efc74188d5464db6c5a9d3decd4835ed340208a6ac39f04af14f2f93a35a--go-1.17.x.tgz
fetching kw-updated_worker/cache-linux-xenial-8e66efc74188d5464db6c5a9d3decd4835ed340208a6ac39f04af14f2f93a35a--go-1.17.x.tgz
fetching kw-updated_worker/cache--go-1.17.x.tgz
fetching master/cache--linux-xenial-8e66efc74188d5464db6c5a9d3decd4835ed340208a6ac39f04af14f2f93a35a--go-1.17.x.tgz
found cache
travis_time:end:2f12e9f6:start=1718805674487304418,finish=1718805679341551395,duration=4854246977,event=setup_casher
travis_time:start:38991e09
travis_time:end:38991e09:start=1718805679348574979,finish=1718805679352484046,duration=3909067,event=setup_casher
travis_time:start:0f16ba5c
adding /home/travis/gopath/src/github.com/travis-ci/worker/vendor to cache
creating directory /home/travis/gopath/src/github.com/travis-ci/worker/vendor
adding /home/travis/.cache/go-build to cache
adding /home/travis/gopath/bin to cache
adding /home/travis/gopath/pkg/mod to cache
creating directory /home/travis/gopath/pkg/mod
travis_time:end:0f16ba5c:start=1718805679357505462,finish=1718805698858282648,duration=19500777186,event=setup_casher
travis_fold:end:cache.1

$ gimme version
v1.5.4
$ go version
go version go1.17.13 linux/amd64
travis_fold:start:go.env
$ go env
GO111MODULE="auto"
GOARCH="amd64"
GOBIN=""
GOCACHE="/home/travis/.cache/go-build"
GOENV="/home/travis/.config/go/env"
GOEXE=""
GOEXPERIMENT=""
GOFLAGS=""
GOHOSTARCH="amd64"
GOHOSTOS="linux"
GOINSECURE=""
GOMODCACHE="/home/travis/gopath/pkg/mod"
GONOPROXY=""
GONOSUMDB=""
GOOS="linux"
GOPATH="/home/travis/gopath"
GOPRIVATE=""
GOPROXY="https://proxy.golang.org,direct"
GOROOT="/home/travis/.gimme/versions/go1.17.13.linux.amd64"
GOSUMDB="sum.golang.org"
GOTMPDIR=""
GOTOOLDIR="/home/travis/.gimme/versions/go1.17.13.linux.amd64/pkg/tool/linux_amd64"
GOVCS=""
GOVERSION="go1.17.13"
GCCGO="gccgo"
AR="ar"
CC="gcc"
CXX="g++"
CGO_ENABLED="1"
GOMOD="/home/travis/gopath/src/github.com/travis-ci/worker/go.mod"
CGO_CFLAGS="-g -O2"
CGO_CPPFLAGS=""
CGO_CXXFLAGS="-g -O2"
CGO_FFLAGS="-g -O2"
CGO_LDFLAGS="-g -O2"
PKG_CONFIG="pkg-config"
GOGCCFLAGS="-fPIC -m64 -pthread -fmessage-length=0 -fdebug-prefix-map=/tmp/go-build139983581=/tmp/go-build -gno-record-gcc-switches"
travis_fold:end:go.env
travis_fold:start:install
travis_time:start:1b9c6ad9
$ travis_install_go_dependencies 1.17.x -v
Makefile detected
travis_time:end:1b9c6ad9:start=1718805699080701574,finish=1718805699085739690,duration=5038116,event=install
travis_fold:end:install
travis_time:start:0cd32660
$ vault login --no-print -method=userpass username=$VAULT_USERNAME password=$VAULT_PASS
travis_time:end:0cd32660:start=1718805699091034271,finish=1718805702910149209,duration=3819114938,event=script
The command "vault login --no-print -method=userpass username=$VAULT_USERNAME password=$VAULT_PASS" exited with 0.
travis_time:start:001b04fe
$ vault kv get -field=secret gcp/[secure]-sa-key > /tmp/[secure]_key.json;
travis_time:end:001b04fe:start=1718805702919132135,finish=1718805703234220016,duration=315087881,event=script
The command "vault kv get -field=secret gcp/[secure]-sa-key > /tmp/[secure]_key.json;" exited with 0.
travis_time:start:129b8ed0
$ gcloud -q auth activate-service-account --key-file /tmp/[secure]_key.json;
Activated service account credentials for: [sa-docker-images@[secure].iam.gserviceaccount.com]
travis_time:end:129b8ed0:start=1718805703244094696,finish=1718805705290351672,duration=2046256976,event=script
The command "gcloud -q auth activate-service-account --key-file /tmp/[secure]_key.json;" exited with 0.
travis_time:start:1191b5bc
$ gcloud -q config set project ${GCE_PROJECT}
Updated property [core/project].
WARNING: You do not appear to have access to project [[secure]] or it does not exist.
travis_time:end:1191b5bc:start=1718805705302288968,finish=1718805706689283109,duration=1386994141,event=script
The command "gcloud -q config set project ${GCE_PROJECT}" exited with 0.
travis_time:start:01723f5b
$ gcloud auth configure-docker
Adding credentials for all GCR repositories.
WARNING: A long list of credential helpers may cause delays running 'docker build'. We recommend passing the registry name to configure only the registry you are using.
Docker configuration file updated.
travis_time:end:01723f5b:start=1718805706696463862,finish=1718805708185951744,duration=1489487882,event=script
The command "gcloud auth configure-docker" exited with 0.
travis_time:start:285be407
$ make docker-build
docker build -t [secure].io/[secure]/worker:v6.2.24-5-gc035498 .
Sending build context to Docker daemon  47.08MB


Step 1/16 : FROM golang:1.21 as builder
1.21: Pulling from library/golang
fea1432adf09: Pulling fs layer
5651b5803b18: Pulling fs layer
3873416e6a33: Pulling fs layer
6efb595508de: Pulling fs layer
98b7747f5ef5: Pulling fs layer
1a74743e93e9: Pulling fs layer
4f4fb700ef54: Pulling fs layer
6efb595508de: Waiting
98b7747f5ef5: Waiting
1a74743e93e9: Waiting
4f4fb700ef54: Waiting
5651b5803b18: Verifying Checksum
5651b5803b18: Download complete
fea1432adf09: Verifying Checksum
fea1432adf09: Download complete
3873416e6a33: Verifying Checksum
3873416e6a33: Download complete
1a74743e93e9: Verifying Checksum
1a74743e93e9: Download complete
4f4fb700ef54: Verifying Checksum
4f4fb700ef54: Download complete
98b7747f5ef5: Verifying Checksum
98b7747f5ef5: Download complete
6efb595508de: Verifying Checksum
6efb595508de: Download complete
fea1432adf09: Pull complete
5651b5803b18: Pull complete
3873416e6a33: Pull complete
6efb595508de: Pull complete
98b7747f5ef5: Pull complete
1a74743e93e9: Pull complete
4f4fb700ef54: Pull complete
Digest: sha256:2eb85b8942c29145b4a5bed2d0f3dc1a3ba2f823aec74afe16751da108a585e1
Status: Downloaded newer image for golang:1.21
 ---> 4b088a6b9b88
Step 2/16 : MAINTAINER Travis CI GmbH <support+travis-worker-docker-image@travis-ci.org>
 ---> Running in e3754e889e2a
Removing intermediate container e3754e889e2a
 ---> 213e5411f81c
Step 3/16 : COPY . /go/src/github.com/travis-ci/worker
 ---> ebd34e098bf7
Step 4/16 : WORKDIR /go/src/github.com/travis-ci/worker
 ---> Running in 858d111c5f98
Removing intermediate container 858d111c5f98
 ---> 399018bb9a7f
Step 5/16 : ENV CGO_ENABLED 0
 ---> Running in b631a72a5dcd
Removing intermediate container b631a72a5dcd
 ---> 7dce1ed12ca4
Step 6/16 : RUN make build
 ---> Running in e6acfad64110
make: bash: Operation not permitted
make: bash: Operation not permitted
make: bash: Operation not permitted
GO111MODULE=on go mod download
make: bash: Operation not permitted
make: bash: Operation not permitted
make: *** [Makefile:104: .deps-fetched] Error 127
The command '/bin/sh -c make build' returned a non-zero code: 2
Makefile:84: recipe for target 'docker-build' failed
make: *** [docker-build] Error 2
travis_time:end:285be407:start=1718805708197204109,finish=1718805737456948578,duration=29259744469,event=script
The command "make docker-build" exited with 2.
travis_time:start:07342092
$ make docker-push
./script/docker-push
time=2024-06-19T14:02:17Z msg="docker login"
WARNING! Your password will be stored unencrypted in /home/travis/.docker/config.json.
Configure a credential helper to remove this warning. See
https://docs.docker.com/engine/reference/commandline/login/#credentials-store

Login Succeeded
time=2024-06-19T14:02:17Z msg="docker push" dest=[secure].io/[secure]/worker:v6.2.24-5-gc035498 attempt=1
The push refers to repository [[secure].io/[secure]/worker]
An image does not exist locally with the tag: [secure].io/[secure]/worker
time=2024-06-19T14:02:18Z msg="sleeping" interval=10
time=2024-06-19T14:02:28Z msg="docker push" dest=[secure].io/[secure]/worker:v6.2.24-5-gc035498 attempt=2
The push refers to repository [[secure].io/[secure]/worker]
An image does not exist locally with the tag: [secure].io/[secure]/worker
time=2024-06-19T14:02:29Z msg="sleeping" interval=20
time=2024-06-19T14:02:49Z msg="docker push" dest=[secure].io/[secure]/worker:v6.2.24-5-gc035498 attempt=3
The push refers to repository [[secure].io/[secure]/worker]
An image does not exist locally with the tag: [secure].io/[secure]/worker
time=2024-06-19T14:02:49Z msg="sleeping" interval=30
time=2024-06-19T14:03:19Z msg="docker push" dest=[secure].io/[secure]/worker:v6.2.24-5-gc035498 attempt=4
The push refers to repository [[secure].io/[secure]/worker]
An image does not exist locally with the tag: [secure].io/[secure]/worker
time=2024-06-19T14:03:20Z msg="sleeping" interval=40
time=2024-06-19T14:04:00Z msg="docker push" dest=[secure].io/[secure]/worker:v6.2.24-5-gc035498 attempt=5
The push refers to repository [[secure].io/[secure]/worker]
An image does not exist locally with the tag: [secure].io/[secure]/worker
time=2024-06-19T14:04:01Z msg="sleeping" interval=50
time=2024-06-19T14:04:51Z msg="docker push" dest=[secure].io/[secure]/worker:v6.2.24-5-gc035498 attempt=6
The push refers to repository [[secure].io/[secure]/worker]
An image does not exist locally with the tag: [secure].io/[secure]/worker
time=2024-06-19T14:04:51Z msg="sleeping" interval=60
time=2024-06-19T14:05:51Z msg="docker push" dest=[secure].io/[secure]/worker:v6.2.24-5-gc035498 attempt=7
The push refers to repository [[secure].io/[secure]/worker]
An image does not exist locally with the tag: [secure].io/[secure]/worker
Makefile:53: recipe for target 'docker-push' failed
make: *** [docker-push] Error 86
travis_time:end:07342092:start=1718805737466387177,finish=1718805952360522654,duration=214894135477,event=script
The command "make docker-push" exited with 2.
travis_fold:start:before_cache
travis_time:start:084a2600
$ make clean
./script/clean
travis_time:end:084a2600:start=1718805952368352412,finish=1718805952674890036,duration=306537624,event=before_cache
travis_fold:end:before_cache
travis_fold:start:cache.2
store build cache
travis_time:start:06eec7c0
travis_time:end:06eec7c0:start=1718805952681293487,finish=1718805952684648024,duration=3354537,event=cache
travis_time:start:1a17a248
nothing changed
travis_time:end:1a17a248:start=1718805952689433100,finish=1718805958854182680,duration=6164749580,event=cache
travis_fold:end:cache.2


Done. Your build exited with 1.