travis_fold:start:worker_info
Worker information
hostname: efb08628-93df-42ae-8c67-455dfc8d6d83@1.worker-n2-com-779d777f7b-twnw9.gce-production-1
version: 6.2.22 https://github.com/travis-ci/worker/tree/858cb91994a513269f2fe9782c15fc113e966231
instance: travis-job-a28ca4e5-0b35-457e-a601-2161302b77f4 travis-ci-sardonyx-xenial-1684402799-0876f6f0 (via amqp)
startup: 6.069720363s
travis_fold:end:worker_info
travis_time:start:06e38134
travis_time:end:06e38134:start=1718805552544742992,finish=1718805552707130138,duration=162387146,event=no_world_writable_dirs
travis_time:start:060778be
travis_time:end:060778be:start=1718805552710328807,finish=1718805552713687970,duration=3359163,event=setup_filter
travis_time:start:0f38abfa
travis_time:end:0f38abfa:start=1718805552719964805,finish=1718805552727146076,duration=7181271,event=agent
travis_time:start:042f06c6
travis_time:end:042f06c6:start=1718805552730231563,finish=1718805552732193166,duration=1961603,event=check_unsupported
travis_time:start:150ce640
travis_fold:start:system_info
Build system information
Build language: go
Build dist: xenial
Build id: 271035505
Job id: 623120380
Runtime kernel version: 4.15.0-1098-gcp
travis-build version: 3484ecfe
Build image provisioning date and time
Thu May 18 10:07:51 UTC 2023
Operating System Details
Distributor ID:	Ubuntu
Description:	Ubuntu 16.04.7 LTS
Release:	16.04
Codename:	xenial
Systemd Version
systemd 229
Cookbooks Version
d19e5ff https://github.com/travis-ci/travis-cookbooks/tree/d19e5ff
git version
git version 2.40.1
bash version
GNU bash, version 4.3.48(1)-release (x86_64-pc-linux-gnu)
gcc version
gcc (Ubuntu 5.4.0-6ubuntu1~16.04.12) 5.4.0 20160609
docker version
Client: Docker Engine - Community
 Version:           20.10.7
 API version:       1.41
 Go version:        go1.13.15
 Git commit:        f0df350
 Built:             Wed Jun  2 11:56:47 2021
 OS/Arch:           linux/amd64
 Context:           default
 Experimental:      true

Server: Docker Engine - Community
 Engine:
  Version:          20.10.7
  API version:      1.41 (minimum version 1.12)
  Go version:       go1.13.15
  Git commit:       b0f5bc3
  Built:            Wed Jun  2 11:54:58 2021
  OS/Arch:          linux/amd64
  Experimental:     false
 containerd:
  Version:          1.4.6
  GitCommit:        d71fcd7d8303cbf684402823e425e9dd2e99285d
 runc:
  Version:          1.0.0-rc95
  GitCommit:        b9ee9c6314599f1b4a7f497e1f1f856fe433d3b7
 docker-init:
  Version:          0.19.0
  GitCommit:        de40ad0
clang version
clang version 7.0.0 (tags/RELEASE_700/final)
jq version
jq-1.6
bats version
Bats 0.4.0
shellcheck version
0.7.2
shfmt version
v3.2.1
ccache version
3.2.4
cmake version
cmake version 3.26.3
heroku version
heroku/8.1.3 linux-x64 node-v16.19.0
imagemagick version
Version: ImageMagick 6.8.9-9 Q16 x86_64 2020-12-04 http://www.imagemagick.org
md5deep version
4.4
mercurial version
version 5.9.3
mysql version
mysql  Ver 14.14 Distrib 5.7.33, for Linux (x86_64) using  EditLine wrapper
openssl version
OpenSSL 1.0.2g  1 Mar 2016
packer version
1.7.5
postgresql client version
psql (PostgreSQL) 10.17 (Ubuntu 10.17-1.pgdg16.04+1)
ragel version
Ragel State Machine Compiler version 6.8 Feb 2013
sudo version
1.8.16
gzip version
gzip 1.6
zip version
Zip 3.0
vim version
VIM - Vi IMproved 7.4 (2013 Aug 10, compiled Oct 13 2020 16:04:38)
iptables version
iptables v1.6.0
curl version
curl 7.47.0 (x86_64-pc-linux-gnu) libcurl/7.47.0 GnuTLS/3.4.10 zlib/1.2.8 libidn/1.32 librtmp/2.3
wget version
GNU Wget 1.17.1 built on linux-gnu.
rsync version
rsync  version 3.1.1  protocol version 31
gimme version
v1.5.4
nvm version
0.39.3
perlbrew version
/home/travis/perl5/perlbrew/bin/perlbrew  - App::perlbrew/0.95
phpenv version
rbenv 1.2.0
rvm version
rvm 1.29.12 (latest) by Michal Papis, Piotr Kuczynski, Wayne E. Seguin [https://rvm.io]
default ruby version
ruby 2.7.6p219 (2022-04-12 revision c9c2245c0a) [x86_64-linux]
default python version
Python 3.7.13
CouchDB version
couchdb 1.6.1
ElasticSearch version
7.16.3
Installed Firefox version
firefox 63.0.1
MongoDB version
MongoDB 4.4.21
PhantomJS version
2.1.1
Pre-installed PostgreSQL versions
9.4.26
9.5.25
9.6.22
Redis version
redis-server 6.0.6
Pre-installed Go versions
1.18.4
ant version
Apache Ant(TM) version 1.9.6 compiled on July 20 2018
mvn version
Apache Maven 3.8.8 (4c87b05d9aedce574290d1acc98575ed5eb6cd39)
gradle version
Gradle 7.5.1!
lein version
Leiningen 2.10.0 on Java 11.0.15.1 OpenJDK 64-Bit Server VM
Pre-installed Node.js versions
v10.24.1
v12.22.12
v14.21.3
v16.15
v16.16.0
v16.20.0
v18.16.0
v4.9.1
v6.17.1
v8.17.0
phpenv versions
  system
  7.4
* 7.4.30 (set by /home/travis/.phpenv/version)
  hhvm-stable
  hhvm
composer --version
Composer version 2.3.7 2022-06-06 16:43:28
Pre-installed Ruby versions
ruby-2.7.6
ruby-3.0.4
ruby-3.1.2
travis_fold:end:system_info

travis_time:end:150ce640:start=1718805552734953414,finish=1718805552744970455,duration=10017041,event=show_system_info
travis_time:start:27462f8a
travis_time:end:27462f8a:start=1718805552749375797,finish=1718805552762157244,duration=12781447,event=rm_riak_source
travis_time:start:0dbad884
travis_time:end:0dbad884:start=1718805552765268935,finish=1718805552770835491,duration=5566556,event=fix_rwky_redis
travis_time:start:1948ec30
travis_time:end:1948ec30:start=1718805552776901658,finish=1718805553564034120,duration=787132462,event=wait_for_network
travis_time:start:0334b900
travis_time:end:0334b900:start=1718805553568860454,finish=1718805575625444307,duration=22056583853,event=update_apt_keys
travis_time:start:06c9d997
travis_time:end:06c9d997:start=1718805575630204079,finish=1718805575682916264,duration=52712185,event=fix_hhvm_source
travis_time:start:121a2464
travis_time:end:121a2464:start=1718805575686714110,finish=1718805575690041946,duration=3327836,event=update_mongo_arch
travis_time:start:13e492ac
travis_time:end:13e492ac:start=1718805575693731455,finish=1718805575739193394,duration=45461939,event=fix_sudo_enabled_trusty
travis_time:start:03791474
travis_time:end:03791474:start=1718805575748073178,finish=1718805575750538471,duration=2465293,event=update_glibc
travis_time:start:126712b0
travis_time:end:126712b0:start=1718805575757478704,finish=1718805575791223511,duration=33744807,event=clean_up_path
travis_time:start:0b7e42d0
travis_time:end:0b7e42d0:start=1718805575795062402,finish=1718805575803529271,duration=8466869,event=fix_resolv_conf
travis_time:start:133fc233
travis_time:end:133fc233:start=1718805575810741849,finish=1718805575819813618,duration=9071769,event=fix_etc_hosts
travis_time:start:102cc63f
travis_time:end:102cc63f:start=1718805575828732912,finish=1718805575837222085,duration=8489173,event=fix_mvn_settings_xml
travis_time:start:13605711
travis_time:end:13605711:start=1718805575842586300,finish=1718805575852052763,duration=9466463,event=no_ipv6_localhost
travis_time:start:28b67470
travis_time:end:28b67470:start=1718805575858209090,finish=1718805575862107290,duration=3898200,event=fix_etc_mavenrc
travis_time:start:2185eb54
OK
travis_time:end:2185eb54:start=1718805575869398236,finish=1718805576191757396,duration=322359160,event=fix_perforce_key
travis_time:start:1b913b42
travis_time:end:1b913b42:start=1718805576200876135,finish=1718805576204464766,duration=3588631,event=fix_wwdr_certificate
travis_time:start:0353bef4
travis_time:end:0353bef4:start=1718805576213931035,finish=1718805576237363994,duration=23432959,event=put_localhost_first
travis_time:start:05a031ba
travis_time:end:05a031ba:start=1718805576240990092,finish=1718805576243818657,duration=2828565,event=home_paths
travis_time:start:1e531118
travis_time:end:1e531118:start=1718805576249882235,finish=1718805576261592631,duration=11710396,event=disable_initramfs
travis_time:start:00491808
travis_time:end:00491808:start=1718805576265977597,finish=1718805576502134010,duration=236156413,event=disable_ssh_roaming
travis_time:start:0acd1e0a
travis_time:end:0acd1e0a:start=1718805576507490261,finish=1718805576510683898,duration=3193637,event=debug_tools
travis_time:start:1d1b67e8
travis_time:end:1d1b67e8:start=1718805576518580808,finish=1718805576522025589,duration=3444781,event=uninstall_oclint
travis_time:start:05356dac
travis_time:end:05356dac:start=1718805576529483716,finish=1718805576533832352,duration=4348636,event=rvm_use
travis_time:start:2ce63a40
travis_time:end:2ce63a40:start=1718805576538959210,finish=1718805576546791657,duration=7832447,event=rm_etc_boto_cfg
travis_time:start:00339dc0
travis_time:end:00339dc0:start=1718805576555393606,finish=1718805576559343090,duration=3949484,event=rm_oraclejdk8_symlink
travis_time:start:0253b43e
travis_time:end:0253b43e:start=1718805576568186446,finish=1718805576658629909,duration=90443463,event=enable_i386
travis_time:start:2accec20
travis_time:end:2accec20:start=1718805576663853029,finish=1718805576668086810,duration=4233781,event=update_rubygems
travis_time:start:043d267a
travis_time:end:043d267a:start=1718805576677902203,finish=1718805577501721410,duration=823819207,event=ensure_path_components
travis_time:start:06de3b76
travis_time:end:06de3b76:start=1718805577511864438,finish=1718805577514639594,duration=2775156,event=redefine_curl
travis_time:start:027053a3
travis_time:end:027053a3:start=1718805577520385187,finish=1718805577624241091,duration=103855904,event=nonblock_pipe
travis_time:start:199bc5b0
travis_time:end:199bc5b0:start=1718805577632854083,finish=1718805583666115849,duration=6033261766,event=apt_get_update
travis_time:start:04bcea38
travis_time:end:04bcea38:start=1718805583672415801,finish=1718805583674800861,duration=2385060,event=deprecate_xcode_64
travis_time:start:2b7de4cc
travis_time:end:2b7de4cc:start=1718805583684461339,finish=1718805587295781417,duration=3611320078,event=update_heroku
travis_time:start:0fd267e0
travis_time:end:0fd267e0:start=1718805587300943674,finish=1718805587303440575,duration=2496901,event=shell_session_update
travis_time:start:2be211ba
travis_fold:start:docker_mtu_and_registry_mirrors
travis_fold:end:docker_mtu_and_registry_mirrors
travis_time:end:2be211ba:start=1718805587311588987,finish=1718805589730620462,duration=2419031475,event=set_docker_mtu_and_registry_mirrors
travis_time:start:19116db8
travis_fold:start:resolvconf
travis_fold:end:resolvconf
travis_time:end:19116db8:start=1718805589746255787,finish=1718805589815100844,duration=68845057,event=resolvconf
travis_time:start:0e240dce
travis_time:end:0e240dce:start=1718805589821283818,finish=1718805589950242490,duration=128958672,event=maven_central_mirror
travis_time:start:1e5d9206
travis_time:end:1e5d9206:start=1718805589954043589,finish=1718805590049244290,duration=95200701,event=maven_https
travis_fold:start:apt
travis_time:start:08fd28ec
$ travis_apt_get_update
travis_time:end:08fd28ec:start=1718805590054306921,finish=1718805598849865805,duration=8795558884,event=prepare
Installing APT Packages
travis_time:start:0237f1d4
$ sudo -E apt-get -yq --no-install-suggests --no-install-recommends $(travis_apt_get_options) install rabbitmq-server
Reading package lists...
Building dependency tree...
Reading state information...
The following additional packages will be installed:
  erlang-corba erlang-diameter erlang-edoc erlang-eldap erlang-erl-docgen
  erlang-ic erlang-nox erlang-odbc erlang-parsetools erlang-percept erlang-ssh
  libodbc1
Suggested packages:
  erlang erlang-manpages erlang-doc xsltproc fop erlang-ic-java libmyodbc
  odbc-postgresql tdsodbc unixodbc-bin
The following NEW packages will be installed:
  erlang-corba erlang-diameter erlang-edoc erlang-eldap erlang-erl-docgen
  erlang-ic erlang-nox erlang-odbc erlang-parsetools erlang-percept erlang-ssh
  libodbc1 rabbitmq-server
0 upgraded, 13 newly installed, 0 to remove and 23 not upgraded.
Need to get 9,422 kB of archives.
After this operation, 14.5 MB of additional disk space will be used.
Get:1 http://us-east-1.ec2.archive.ubuntu.com/ubuntu xenial-updates/main amd64 erlang-corba amd64 1:18.3-dfsg-1ubuntu3.1 [2,233 kB]
Get:2 http://us-east-1.ec2.archive.ubuntu.com/ubuntu xenial-updates/main amd64 erlang-diameter amd64 1:18.3-dfsg-1ubuntu3.1 [642 kB]
Get:3 http://us-east-1.ec2.archive.ubuntu.com/ubuntu xenial-updates/main amd64 erlang-edoc amd64 1:18.3-dfsg-1ubuntu3.1 [292 kB]
Get:4 http://us-east-1.ec2.archive.ubuntu.com/ubuntu xenial-updates/main amd64 erlang-eldap amd64 1:18.3-dfsg-1ubuntu3.1 [99.3 kB]
Get:5 http://us-east-1.ec2.archive.ubuntu.com/ubuntu xenial-updates/main amd64 erlang-erl-docgen amd64 1:18.3-dfsg-1ubuntu3.1 [132 kB]
Get:6 http://us-east-1.ec2.archive.ubuntu.com/ubuntu xenial-updates/main amd64 erlang-ic amd64 1:18.3-dfsg-1ubuntu3.1 [816 kB]
Get:7 http://us-east-1.ec2.archive.ubuntu.com/ubuntu xenial/main amd64 libodbc1 amd64 2.3.1-4.1 [180 kB]
Get:8 http://us-east-1.ec2.archive.ubuntu.com/ubuntu xenial-updates/main amd64 erlang-odbc amd64 1:18.3-dfsg-1ubuntu3.1 [47.3 kB]
Get:9 http://us-east-1.ec2.archive.ubuntu.com/ubuntu xenial-updates/main amd64 erlang-parsetools amd64 1:18.3-dfsg-1ubuntu3.1 [153 kB]
Get:10 http://us-east-1.ec2.archive.ubuntu.com/ubuntu xenial-updates/main amd64 erlang-percept amd64 1:18.3-dfsg-1ubuntu3.1 [132 kB]
Get:11 http://us-east-1.ec2.archive.ubuntu.com/ubuntu xenial-updates/main amd64 erlang-ssh amd64 1:18.3-dfsg-1ubuntu3.1 [430 kB]
Get:12 http://us-east-1.ec2.archive.ubuntu.com/ubuntu xenial-updates/main amd64 erlang-nox all 1:18.3-dfsg-1ubuntu3.1 [14.2 kB]
Get:13 http://us-east-1.ec2.archive.ubuntu.com/ubuntu xenial-updates/main amd64 rabbitmq-server all 3.5.7-1ubuntu0.16.04.4 [4,251 kB]
Fetched 9,422 kB in 0s (18.1 MB/s)
Selecting previously unselected package erlang-corba.
(Reading database ... 
(Reading database ... 5%
(Reading database ... 10%
(Reading database ... 15%
(Reading database ... 20%
(Reading database ... 25%
(Reading database ... 30%
(Reading database ... 35%
(Reading database ... 40%
(Reading database ... 45%
(Reading database ... 50%
(Reading database ... 55%
(Reading database ... 60%
(Reading database ... 65%
(Reading database ... 70%
(Reading database ... 75%
(Reading database ... 80%
(Reading database ... 85%
(Reading database ... 90%
(Reading database ... 95%
(Reading database ... 100%
(Reading database ... 165746 files and directories currently installed.)
Preparing to unpack .../erlang-corba_1%3a18.3-dfsg-1ubuntu3.1_amd64.deb ...
Unpacking erlang-corba (1:18.3-dfsg-1ubuntu3.1) ...
Selecting previously unselected package erlang-diameter.
Preparing to unpack .../erlang-diameter_1%3a18.3-dfsg-1ubuntu3.1_amd64.deb ...
Unpacking erlang-diameter (1:18.3-dfsg-1ubuntu3.1) ...
Selecting previously unselected package erlang-edoc.
Preparing to unpack .../erlang-edoc_1%3a18.3-dfsg-1ubuntu3.1_amd64.deb ...
Unpacking erlang-edoc (1:18.3-dfsg-1ubuntu3.1) ...
Selecting previously unselected package erlang-eldap.
Preparing to unpack .../erlang-eldap_1%3a18.3-dfsg-1ubuntu3.1_amd64.deb ...
Unpacking erlang-eldap (1:18.3-dfsg-1ubuntu3.1) ...
Selecting previously unselected package erlang-erl-docgen.
Preparing to unpack .../erlang-erl-docgen_1%3a18.3-dfsg-1ubuntu3.1_amd64.deb ...
Unpacking erlang-erl-docgen (1:18.3-dfsg-1ubuntu3.1) ...
Selecting previously unselected package erlang-ic.
Preparing to unpack .../erlang-ic_1%3a18.3-dfsg-1ubuntu3.1_amd64.deb ...
Unpacking erlang-ic (1:18.3-dfsg-1ubuntu3.1) ...
Selecting previously unselected package libodbc1:amd64.
Preparing to unpack .../libodbc1_2.3.1-4.1_amd64.deb ...
Unpacking libodbc1:amd64 (2.3.1-4.1) ...
Selecting previously unselected package erlang-odbc.
Preparing to unpack .../erlang-odbc_1%3a18.3-dfsg-1ubuntu3.1_amd64.deb ...
Unpacking erlang-odbc (1:18.3-dfsg-1ubuntu3.1) ...
Selecting previously unselected package erlang-parsetools.
Preparing to unpack .../erlang-parsetools_1%3a18.3-dfsg-1ubuntu3.1_amd64.deb ...
Unpacking erlang-parsetools (1:18.3-dfsg-1ubuntu3.1) ...
Selecting previously unselected package erlang-percept.
Preparing to unpack .../erlang-percept_1%3a18.3-dfsg-1ubuntu3.1_amd64.deb ...
Unpacking erlang-percept (1:18.3-dfsg-1ubuntu3.1) ...
Selecting previously unselected package erlang-ssh.
Preparing to unpack .../erlang-ssh_1%3a18.3-dfsg-1ubuntu3.1_amd64.deb ...
Unpacking erlang-ssh (1:18.3-dfsg-1ubuntu3.1) ...
Selecting previously unselected package erlang-nox.
Preparing to unpack .../erlang-nox_1%3a18.3-dfsg-1ubuntu3.1_all.deb ...
Unpacking erlang-nox (1:18.3-dfsg-1ubuntu3.1) ...
Selecting previously unselected package rabbitmq-server.
Preparing to unpack .../rabbitmq-server_3.5.7-1ubuntu0.16.04.4_all.deb ...
Unpacking rabbitmq-server (3.5.7-1ubuntu0.16.04.4) ...
Processing triggers for man-db (2.7.5-1) ...
Processing triggers for libc-bin (2.23-0ubuntu11.3) ...
Processing triggers for ureadahead (0.100.0-19.1) ...
Processing triggers for systemd (229-4ubuntu21.31) ...
Setting up erlang-corba (1:18.3-dfsg-1ubuntu3.1) ...
Setting up erlang-diameter (1:18.3-dfsg-1ubuntu3.1) ...
Setting up erlang-edoc (1:18.3-dfsg-1ubuntu3.1) ...
Setting up erlang-eldap (1:18.3-dfsg-1ubuntu3.1) ...
Setting up erlang-erl-docgen (1:18.3-dfsg-1ubuntu3.1) ...
Setting up erlang-ic (1:18.3-dfsg-1ubuntu3.1) ...
Setting up libodbc1:amd64 (2.3.1-4.1) ...
Setting up erlang-odbc (1:18.3-dfsg-1ubuntu3.1) ...
Setting up erlang-parsetools (1:18.3-dfsg-1ubuntu3.1) ...
Setting up erlang-percept (1:18.3-dfsg-1ubuntu3.1) ...
Setting up erlang-ssh (1:18.3-dfsg-1ubuntu3.1) ...
Setting up erlang-nox (1:18.3-dfsg-1ubuntu3.1) ...
Setting up rabbitmq-server (3.5.7-1ubuntu0.16.04.4) ...
Adding group `rabbitmq' (GID 127) ...
Done.
Adding system user `rabbitmq' (UID 122) ...
Adding new user `rabbitmq' (UID 122) with group `rabbitmq' ...
Not creating home directory `/var/lib/rabbitmq'.
Processing triggers for libc-bin (2.23-0ubuntu11.3) ...
Processing triggers for ureadahead (0.100.0-19.1) ...
Processing triggers for systemd (229-4ubuntu21.31) ...
travis_time:end:0237f1d4:start=1718805598855443690,finish=1718805607057500032,duration=8202056342,event=prepare
travis_fold:end:apt
travis_time:start:1f1c1a6e
travis_fold:start:services
travis_time:start:22267278
$ sudo systemctl start rabbitmq-server
travis_time:end:22267278:start=1718805607067071890,finish=1718805607078853743,duration=11781853,event=prepare
travis_time:start:013d8d48
$ sudo systemctl start docker
travis_time:end:013d8d48:start=1718805607084188194,finish=1718805607095785234,duration=11597040,event=prepare
travis_time:start:021899e2
$ sudo systemctl start redis-server
travis_time:end:021899e2:start=1718805607101505886,finish=1718805607181268859,duration=79762973,event=prepare
travis_fold:end:services
travis_time:end:021899e2:start=1718805607101505886,finish=1718805610185932095,duration=3084426209,event=services
travis_time:start:211ec870
travis_time:end:211ec870:start=1718805610191380893,finish=1718805610195852163,duration=4471270,event=fix_ps4
Updating gimme
travis_time:start:2b4f8adc

travis_fold:start:git.checkout
travis_time:start:2a919995
travis_time:end:2a919995:start=1718805616208999054,finish=1718805616215616189,duration=6617135,event=checkout
travis_time:start:2270f505
$ git clone --depth=10 --branch=kw-updated_worker https://github.com/travis-ci/worker.git travis-ci/worker
Cloning into 'travis-ci/worker'...
travis_time:end:2270f505:start=1718805616221165651,finish=1718805617005007734,duration=783842083,event=checkout
$ cd travis-ci/worker
$ git checkout -qf c035498feb2a1ce730637951f5598fd7117f062b
travis_fold:end:git.checkout

travis_time:end:2270f505:start=1718805616221165651,finish=1718805617016152286,duration=794986635,event=checkout
$ travis_export_go 1.17.x github.com/travis-ci/worker
travis_time:start:032ea794

Setting environment variables from repository settings
$ export ARTIFACTS_PATHS=./build
$ export ARTIFACTS_BUCKET=travis-worker-artifacts
$ export ARTIFACTS_PERMISSIONS=public-read
$ export ARTIFACTS_KEY=[secure]
$ export ARTIFACTS_SECRET=[secure]
$ export PACKAGECLOUD_TOKEN=[secure]
$ export DOCKER_HUB_TRIGGER_URL=[secure]
$ export DOCKER_LOGIN_USERNAME=[secure]
$ export DOCKER_LOGIN_PASSWORD=[secure]
$ export VAULT_PASS=[secure]
$ export GCE_PROJECT=[secure]
$ export VAULT_USERNAME=[secure]
$ export VAULT_ADDR=[secure]
$ export CLOUDSDK_CORE_DISABLE_PROMPTS=[secure]

Setting environment variables from .travis.yml
$ export AMQP_URI="amqp://"
$ export GOPATH="$HOME/gopath"
$ export PATH="bin:$HOME/gopath/bin:$HOME/bin:$PATH"
$ export CHECKOUT_ROOT="$HOME/gopath/src/github.com/travis-ci/worker"
$ export GO15VENDOREXPERIMENT='1'
$ export REDIS_URL="redis://"

travis_time:end:032ea794:start=1718805617029708945,finish=1718805617053228003,duration=23519058,event=env
travis_time:start:138ff578
$ travis_setup_go
go version go1.17.13 linux/amd64
$ export GOPATH="/home/travis/gopath"
$ export PATH="/home/travis/gopath/bin:/home/travis/.gimme/versions/go1.17.13.linux.amd64/bin:bin:/home/travis/gopath/bin:/home/travis/bin:/home/travis/bin:/home/travis/bin:/home/travis/.local/bin:/usr/local/lib/jvm/openjdk11/bin:/opt/pyenv/shims:/home/travis/.phpenv/shims:/home/travis/perl5/perlbrew/bin:/home/travis/perl5/perlbrew/perls/5.34.1/bin:/home/travis/.nvm/versions/node/v16.16.0/bin:/home/travis/.rvm/gems/ruby-2.7.6/bin:/home/travis/.rvm/gems/ruby-2.7.6@global/bin:/home/travis/.rvm/rubies/ruby-2.7.6/bin:/home/travis/gopath/bin:/home/travis/.gimme/versions/go1.18.4.linux.amd64/bin:/usr/local/maven-3.8.8/bin:/usr/local/cmake-3.26.3/bin:/usr/local/clang-7.0.0/bin:/usr/local/sbin:/usr/local/bin:/usr/sbin:/usr/bin:/sbin:/bin:/snap/bin:/home/travis/.rvm/bin:/home/travis/.phpenv/bin:/opt/pyenv/bin:/home/travis/.yarn/bin"
$ export GO111MODULE="auto"
travis_time:end:138ff578:start=1718805617074742876,finish=1718805621774101909,duration=4699359033,event=
travis_fold:start:cache.1
Setting up build cache
$ export CASHER_DIR=${TRAVIS_HOME}/.casher
travis_time:start:00c44e26
$ Installing caching utilities
travis_time:end:00c44e26:start=1718805622582340184,finish=1718805622856390688,duration=274050504,event=setup_casher
travis_time:start:09670431
travis_time:end:09670431:start=1718805622863317408,finish=1718805622866870718,duration=3553310,event=setup_casher
travis_time:start:10daa9ed
attempting to download cache archive
fetching kw-updated_worker/cache--linux-xenial-8e66efc74188d5464db6c5a9d3decd4835ed340208a6ac39f04af14f2f93a35a--go-1.17.x.tgz
fetching kw-updated_worker/cache-linux-xenial-8e66efc74188d5464db6c5a9d3decd4835ed340208a6ac39f04af14f2f93a35a--go-1.17.x.tgz
fetching kw-updated_worker/cache--go-1.17.x.tgz
fetching master/cache--linux-xenial-8e66efc74188d5464db6c5a9d3decd4835ed340208a6ac39f04af14f2f93a35a--go-1.17.x.tgz
found cache
travis_time:end:10daa9ed:start=1718805622874167539,finish=1718805638844730564,duration=15970563025,event=setup_casher
travis_time:start:0fe011e0
travis_time:end:0fe011e0:start=1718805638852037488,finish=1718805638855005587,duration=2968099,event=setup_casher
travis_time:start:025ede66
adding /home/travis/gopath/src/github.com/travis-ci/worker/vendor to cache
creating directory /home/travis/gopath/src/github.com/travis-ci/worker/vendor
adding /home/travis/.cache/go-build to cache
adding /home/travis/gopath/bin to cache
adding /home/travis/gopath/pkg/mod to cache
creating directory /home/travis/gopath/pkg/mod
travis_time:end:025ede66:start=1718805638859804548,finish=1718805657879911458,duration=19020106910,event=setup_casher
travis_fold:end:cache.1

$ gimme version
v1.5.4
$ go version
go version go1.17.13 linux/amd64
travis_fold:start:go.env
$ go env
GO111MODULE="auto"
GOARCH="amd64"
GOBIN=""
GOCACHE="/home/travis/.cache/go-build"
GOENV="/home/travis/.config/go/env"
GOEXE=""
GOEXPERIMENT=""
GOFLAGS=""
GOHOSTARCH="amd64"
GOHOSTOS="linux"
GOINSECURE=""
GOMODCACHE="/home/travis/gopath/pkg/mod"
GONOPROXY=""
GONOSUMDB=""
GOOS="linux"
GOPATH="/home/travis/gopath"
GOPRIVATE=""
GOPROXY="https://proxy.golang.org,direct"
GOROOT="/home/travis/.gimme/versions/go1.17.13.linux.amd64"
GOSUMDB="sum.golang.org"
GOTMPDIR=""
GOTOOLDIR="/home/travis/.gimme/versions/go1.17.13.linux.amd64/pkg/tool/linux_amd64"
GOVCS=""
GOVERSION="go1.17.13"
GCCGO="gccgo"
AR="ar"
CC="gcc"
CXX="g++"
CGO_ENABLED="1"
GOMOD="/home/travis/gopath/src/github.com/travis-ci/worker/go.mod"
CGO_CFLAGS="-g -O2"
CGO_CPPFLAGS=""
CGO_CXXFLAGS="-g -O2"
CGO_FFLAGS="-g -O2"
CGO_LDFLAGS="-g -O2"
PKG_CONFIG="pkg-config"
GOGCCFLAGS="-fPIC -m64 -pthread -fmessage-length=0 -fdebug-prefix-map=/tmp/go-build614784803=/tmp/go-build -gno-record-gcc-switches"
travis_fold:end:go.env
travis_fold:start:install
travis_time:start:012fb599
$ travis_install_go_dependencies 1.17.x -v
Makefile detected
travis_time:end:012fb599:start=1718805658111201032,finish=1718805658128790517,duration=17589485,event=install
travis_fold:end:install
travis_time:start:164cd412
$ make deps
if ! shfmt -version 2>/dev/null; then \
	curl -o /home/travis/gopath/bin/shfmt -sSL https://github.com/mvdan/sh/releases/download/v2.5.0/shfmt_v2.5.0_linux_amd64; \
	chmod +x /home/travis/gopath/bin/shfmt; \
	shfmt -version; \
fi
v3.2.1
curl -sSfL https://raw.githubusercontent.com/golangci/golangci-lint/master/install.sh | sh -s -- -b /home/travis/bin
golangci/golangci-lint info checking GitHub for latest tag
golangci/golangci-lint info found version: 1.59.1 for v1.59.1/linux/amd64
golangci/golangci-lint info installed /home/travis/bin/golangci-lint
if ! command -v /bin/golangci-lint &>/dev/null; then \
	/home/travis/bin/golangci-lint --version; \
fi
golangci-lint has version 1.59.1 built with go1.22.3 from 1a55854a on 2024-06-09T18:08:33Z
GO111MODULE=on go mod download
GO111MODULE=on go mod vendor
touch .deps-fetched
travis_time:end:164cd412:start=1718805658139804349,finish=1718805692533703922,duration=34393899573,event=script
The command "make deps" exited with 0.
travis_time:start:15db9384
$ GO111MODULE=on make build
go install -tags netgo -ldflags "-extldflags '-static' -X 'github.com/travis-ci/worker.VersionString=v6.2.24-5-gc035498' -X 'github.com/travis-ci/worker.RevisionString=c035498feb2a1ce730637951f5598fd7117f062b' -X 'github.com/travis-ci/worker.RevisionURLString=https://github.com/travis-ci/worker/tree/c035498feb2a1ce730637951f5598fd7117f062b' -X 'github.com/travis-ci/worker.GeneratedString=2024-06-19T14:01:32+0000' -X 'github.com/travis-ci/worker.CopyrightString=© 2018 Travis CI GmbH'" github.com/travis-ci/worker github.com/travis-ci/worker/remote github.com/travis-ci/worker/image github.com/travis-ci/worker/ssh github.com/travis-ci/worker/metrics github.com/travis-ci/worker/config github.com/travis-ci/worker/context github.com/travis-ci/worker/winrm github.com/travis-ci/worker/errors github.com/travis-ci/worker/ratelimit github.com/travis-ci/worker/backend github.com/travis-ci/worker/cmd/...
# golang.org/x/net/http2
../../../../pkg/mod/golang.org/x/net@v0.23.0/http2/transport.go:1096:13: tc.NetConn undefined (type *tls.Conn has no field or method NetConn)
note: module requires Go 1.18
Makefile:77: recipe for target 'build' failed
make: *** [build] Error 2
travis_time:end:15db9384:start=1718805692542829196,finish=1718805727719862059,duration=35177032863,event=script
The command "GO111MODULE=on make build" exited with 2.
travis_time:start:30bfbf50
$ mkdir -p build/linux/amd64
travis_time:end:30bfbf50:start=1718805727725901755,finish=1718805727731133759,duration=5232004,event=script
The command "mkdir -p build/linux/amd64" exited with 0.
travis_time:start:0a060086
$ cp ${GOPATH%%:*}/bin/travis-worker build/linux/amd64
cp: cannot stat '/home/travis/gopath/bin/travis-worker': No such file or directory
travis_time:end:0a060086:start=1718805727738651054,finish=1718805727748696982,duration=10045928,event=script
The command "cp ${GOPATH%%:*}/bin/travis-worker build/linux/amd64" exited with 1.
travis_time:start:0acc8bac
$ make test-no-cover
go test -race -tags netgo -ldflags "-extldflags '-static' -X 'github.com/travis-ci/worker.VersionString=v6.2.24-5-gc035498' -X 'github.com/travis-ci/worker.RevisionString=c035498feb2a1ce730637951f5598fd7117f062b' -X 'github.com/travis-ci/worker.RevisionURLString=https://github.com/travis-ci/worker/tree/c035498feb2a1ce730637951f5598fd7117f062b' -X 'github.com/travis-ci/worker.GeneratedString=2024-06-19T14:02:07+0000' -X 'github.com/travis-ci/worker.CopyrightString=© 2018 Travis CI GmbH'" github.com/travis-ci/worker github.com/travis-ci/worker/remote github.com/travis-ci/worker/image github.com/travis-ci/worker/ssh github.com/travis-ci/worker/metrics github.com/travis-ci/worker/config github.com/travis-ci/worker/context github.com/travis-ci/worker/winrm github.com/travis-ci/worker/errors github.com/travis-ci/worker/ratelimit github.com/travis-ci/worker/backend github.com/travis-ci/worker/cmd/...
# golang.org/x/net/http2
../../../../pkg/mod/golang.org/x/net@v0.23.0/http2/transport.go:1096:13: tc.NetConn undefined (type *tls.Conn has no field or method NetConn)
note: module requires Go 1.18
# github.com/travis-ci/worker/image [github.com/travis-ci/worker/image.test]
image/api_selector_test.go:91:76: too few values in tagSet{...}
image/api_selector_test.go:92:76: too few values in tagSet{...}
image/api_selector_test.go:93:63: too few values in tagSet{...}
image/api_selector_test.go:94:53: too few values in tagSet{...}
image/api_selector_test.go:97:92: too few values in tagSet{...}
image/api_selector_test.go:98:80: too few values in tagSet{...}
image/api_selector_test.go:99:74: too few values in tagSet{...}
image/api_selector_test.go:100:61: too few values in tagSet{...}
image/api_selector_test.go:101:59: too few values in tagSet{...}
image/api_selector_test.go:102:53: too few values in tagSet{...}
image/api_selector_test.go:102:53: too many errors
FAIL	github.com/travis-ci/worker [build failed]
?   	github.com/travis-ci/worker/remote	[no test files]
FAIL	github.com/travis-ci/worker/image [build failed]
?   	github.com/travis-ci/worker/ssh	[no test files]
?   	github.com/travis-ci/worker/metrics	[no test files]
ok  	github.com/travis-ci/worker/config	0.043s
?   	github.com/travis-ci/worker/context	[no test files]
?   	github.com/travis-ci/worker/winrm	[no test files]
?   	github.com/travis-ci/worker/errors	[no test files]
ok  	github.com/travis-ci/worker/ratelimit	0.104s
FAIL	github.com/travis-ci/worker/backend [build failed]
FAIL	github.com/travis-ci/worker/cmd/travis-worker [build failed]
FAIL
Makefile:66: recipe for target 'test-no-cover' failed
make: *** [test-no-cover] Error 2
travis_time:end:0acc8bac:start=1718805727763724578,finish=1718805796513182860,duration=68749458282,event=script
The command "make test-no-cover" exited with 2.
travis_time:start:1a665c00
$ make test-cover
go test -covermode=count -coverprofile=root-coverage.coverprofile \
	-tags netgo -ldflags "-extldflags '-static' -X 'github.com/travis-ci/worker.VersionString=v6.2.24-5-gc035498' -X 'github.com/travis-ci/worker.RevisionString=c035498feb2a1ce730637951f5598fd7117f062b' -X 'github.com/travis-ci/worker.RevisionURLString=https://github.com/travis-ci/worker/tree/c035498feb2a1ce730637951f5598fd7117f062b' -X 'github.com/travis-ci/worker.GeneratedString=2024-06-19T14:03:16+0000' -X 'github.com/travis-ci/worker.CopyrightString=© 2018 Travis CI GmbH'" \
	github.com/travis-ci/worker/
# golang.org/x/net/http2
../../../../pkg/mod/golang.org/x/net@v0.23.0/http2/transport.go:1096:13: tc.NetConn undefined (type *tls.Conn has no field or method NetConn)
note: module requires Go 1.18
FAIL	github.com/travis-ci/worker [build failed]
FAIL
Makefile:47: recipe for target 'root-coverage.coverprofile' failed
make: *** [root-coverage.coverprofile] Error 2
travis_time:end:1a665c00:start=1718805796526080761,finish=1718805813228905015,duration=16702824254,event=script
The command "make test-cover" exited with 2.
travis_time:start:04f251a6
$ make smoke
./script/smoke
Updated 0 paths from cfb222e
./script/smoke: line 17: ./build/linux/amd64/travis-worker: No such file or directory
Makefile:53: recipe for target 'smoke' failed
make: *** [smoke] Error 1
travis_time:end:04f251a6:start=1718805813234928285,finish=1718805813303155629,duration=68227344,event=script
The command "make smoke" exited with 2.
travis_fold:start:before_cache
travis_time:start:02b18a62
$ make clean
./script/clean
removed './root-coverage.coverprofile'
removed '/home/travis/gopath/pkg/linux_amd64/github.com/travis-ci/worker/winrm.a'
removed '/home/travis/gopath/pkg/linux_amd64/github.com/travis-ci/worker/remote.a'
removed '/home/travis/gopath/pkg/linux_amd64/github.com/travis-ci/worker/metrics.a'
removed '/home/travis/gopath/pkg/linux_amd64/github.com/travis-ci/worker/config.a'
removed '/home/travis/gopath/pkg/linux_amd64/github.com/travis-ci/worker/errors.a'
removed '/home/travis/gopath/pkg/linux_amd64/github.com/travis-ci/worker/context.a'
removed '/home/travis/gopath/pkg/linux_amd64/github.com/travis-ci/worker/image.a'
removed '/home/travis/gopath/pkg/linux_amd64/github.com/travis-ci/worker/ratelimit.a'
removed '/home/travis/gopath/pkg/linux_amd64/github.com/travis-ci/worker/ssh.a'
travis_time:end:02b18a62:start=1718805813319292129,finish=1718805813831748168,duration=512456039,event=before_cache
travis_fold:end:before_cache
travis_fold:start:cache.2
store build cache
travis_time:start:023c1a6d
travis_time:end:023c1a6d:start=1718805813839710196,finish=1718805813843183852,duration=3473656,event=cache
travis_time:start:013f7868
changes detected (content changed, file is created, or file is deleted):\n/home/travis/.cache/go-build/00/0004492075f1f468f013cb6fe9023fe7a2a12ad8f0d61e4587a728ef61a23204-a
/home/travis/.cache/go-build/00/000669d9f0429cf9fb44ddd03287bf4a3c1a8c092459e548236f0d62a2aaa744-a
/home/travis/.cache/go-build/00/000b47d877a786ca3683451363e108912ba984001634e1227e77a8ab40a13686-a
/home/travis/.cache/go-build/00/00142e830e472e8904687111b257d56bc3ccb8d40c06e9ee4af0716f25c86aff-a
/home/travis/.cache/go-build/00/0016fb98ef3fbd9fa2adbed36d075e5e33776df3a3e6591c940a9e838d97ae91-a
/home/travis/.cache/go-build/00/00205e759dc482dd1eb752841ced5e02b31b257cc23e13bb2c882ac1a5da6d02-a
/home/travis/.cache/go-build/00/003d51a77e48b2a4dc548160baf59027f6124ace0cf6ea6e29fb2ef7750e5c05-d
/home/travis/.cache/go-build/00/0040d91c51506f2d46727e11f61eb207d9ee3a1dfc39a593b5f8ad1d8cad4d41-a
/home/travis/.cache/go-build/00/004165057d23e70fe993a322cad79ae5309a0eacd141c104f1aeb82f89fc4659-a
/home/travis/.cache/go-build/00/004379b5d7d713fefe67c64af930ca3ba00057530b34546a57bd165e758be899-a
/home/trav\n...
changes detected, packing new archive
uploading kw-updated_worker/cache--linux-xenial-8e66efc74188d5464db6c5a9d3decd4835ed340208a6ac39f04af14f2f93a35a--go-1.17.x.tgz
cache uploaded
travis_time:end:013f7868:start=1718805813851876956,finish=1718805916496263081,duration=102644386125,event=cache
travis_fold:end:cache.2


Uploading Artifacts
travis_fold:start:artifacts.setup
artifacts version 0.8.2-2-g4ae8d64 revision=4ae8d6436c4432925061bee75ad8fb5b340aa401
travis_fold:end:artifacts.setup
$ artifacts upload
INFO: uploading with settings
  bucket: travis-worker-artifacts
  cache_control: private
  permissions: public-read

Done uploading artifacts


Done. Your build exited with 1.